program: Gaussian 09
title: combined_medium
version: ES64L-G09RevE.01
frameworkgroup: C1[X(C46H17N2O2)]
method: RwB97XD
basis: Gen
operation: Freq
keyword: #P
keyword: Geom=AllCheck
keyword: Guess=TCheck
keyword: SCRF=Check
keyword: GenChk
keyword: RwB97XD/ChkBas
keyword: Freq
converged: YES YES YES YES
title: Mulliken charges:
elementType: C C C C C C C C C C C C C C C C H H C C C C C C C C C C C C C C C C C C C N C C C C C C H C C C C C N H H H H H H H H H H H H H O O H
charge: 0.047650 0.019686 0.058487 0.003295 -0.016018 -0.037743 0.034965 -0.014083 0.012753 0.036287 -0.028865 0.060772 -0.236541 0.114121 -0.263145 0.100241 0.179182 0.187794 0.004903 0.015910 0.025110 -0.045211 0.041188 0.034653 0.070376 0.065958 -0.021742 -0.210381 0.022845 0.049336 0.066285 -0.168071 -0.051166 0.028431 -0.180572 0.051417 -0.214038 -0.498153 -0.197032 -0.172618 0.041644 0.079899 0.120445 0.074860 0.242797 -0.133306 -0.097578 -0.118117 -0.013020 0.051992 -0.476871 0.176600 0.180755 0.186603 0.242304 0.250156 0.231152 0.198649 0.188783 0.178583 0.172192 0.170412 0.171647 0.182717 -0.213893 -0.496808 0.431138
chargesum: 1.00000
title: Mulliken charges with hydrogens summed into heavy atoms:
elementType: C C C C C C C C C C C C C C C C C C C C C C C C C C C C C C C C C C C N C C C C C C C C C C C N O O
charge: 0.047650 0.019686 0.058487 0.003295 -0.016018 -0.037743 0.034965 -0.014083 0.012753 0.036287 -0.028865 0.060772 -0.048746 0.114121 -0.083963 0.100241 0.004903 0.015910 0.025110 -0.045211 0.041188 0.034653 0.070376 0.065958 -0.021742 -0.029626 0.022845 0.049336 0.066285 0.003576 0.125434 0.211148 0.006030 0.051417 -0.041847 -0.498153 -0.018449 -0.002206 0.041644 0.079899 0.120445 0.317657 0.097845 0.152578 0.124187 0.175763 0.250641 -0.476871 -0.213893 -0.065670
polarizability: 1.91207693e+03 -1.33502422e+02 1.73536175e+03 3.71399597e+01 3.95443555e+01 2.29922495e+02
1716.lowfreq: -10.4274 -0.0002 -0.0001 0.0006 10.4559 12.4571 26.7955 39.3075 49.8747
frequency: 26.5941 39.2910 49.8655 62.0825 65.5720 90.0976 103.6761 115.3462 136.2359 164.4457 172.1757 183.7524 207.2426 221.9198 231.8172 245.8813 251.8055 253.2093 258.2143 260.5844 282.2105 289.9008 300.0289 314.0872 335.2137 341.2385 347.4554 354.4070 367.6827 373.4731 387.7061 389.3732 398.1479 403.0390 442.0117 450.1966 459.0157 470.1819 483.2459 504.4672 515.4349 529.4632 538.5970 545.1432 552.0447 553.0527 556.0813 566.2619 568.3893 578.1275 583.3368 588.5406 603.4730 607.8667 614.0913 621.2499 626.1347 628.9245 631.5773 640.2741 644.9207 664.2155 681.8737 685.7071 692.0498 695.3884 697.2459 707.3091 728.3185 738.8156 741.8750 749.6455 756.5656 759.3359 779.9850 785.3281 797.7221 801.6497 807.9086 815.6449 817.1982 826.9957 838.4440 852.8390 870.8129 872.6497 888.9261 894.9199 900.8310 915.0444 923.0311 928.3159 934.0749 941.1058 946.5009 959.0506 970.4232 975.9061 978.9582 984.5960 989.5598 993.2886 1000.3490 1012.0088 1031.0305 1042.6388 1059.7811 1076.2647 1079.3736 1114.6508 1130.9718 1146.4726 1160.5904 1170.8596 1181.2812 1197.7403 1202.4962 1211.0063 1215.1762 1222.6849 1235.9457 1241.8364 1251.9576 1255.5200 1272.1844 1285.2560 1294.9983 1303.1947 1323.5277 1331.2395 1340.4998 1346.0035 1349.8431 1361.9674 1367.1974 1376.7752 1378.9017 1386.3079 1397.7339 1406.0122 1411.9378 1415.2181 1419.7732 1432.2837 1437.2647 1445.2741 1451.8982 1454.1443 1462.2216 1466.3148 1473.8635 1478.5549 1483.4070 1497.1977 1507.6935 1515.4797 1523.9662 1539.6185 1541.5715 1557.1841 1562.0623 1568.5867 1582.4543 1596.2843 1605.8463 1622.0393 1642.5623 1645.3384 1652.7646 1658.9829 1662.9663 1677.0986 1679.4329 1685.2138 1692.6869 1700.0242 1710.6219 1723.9897 3058.1758 3218.6519 3227.0793 3227.4393 3230.0191 3232.4373 3234.8676 3236.8878 3239.6330 3241.1257 3243.7081 3250.0867 3257.6150 3258.1485 3269.1906 3271.1504 3794.6821
redmass: 7.7485 7.4338 6.0774 6.4644 6.3820 5.7034 5.1870 5.6651 6.6786 4.5276 4.2448 4.5543 6.8624 2.1636 6.4701 5.0179 4.2324 4.0045 5.0052 3.0520 8.4596 6.4001 6.3964 4.5652 5.6933 7.4923 5.2539 5.8221 7.3434 5.9078 6.1174 6.2856 8.3790 4.9346 5.6591 6.9733 6.5226 6.1955 7.0460 4.2930 4.5668 4.9238 8.1516 5.3259 4.7738 4.6381 4.6277 4.6070 6.3655 5.1067 8.5763 6.0365 6.1817 5.8707 6.4453 4.5521 6.8453 5.6862 4.3379 5.9116 4.7872 8.4271 7.3123 8.9632 7.8754 7.1037 7.5239 6.2475 5.2703 6.1593 6.0176 5.3757 7.3008 5.5684 6.1117 7.6279 4.7583 3.6991 3.9397 4.5797 2.0432 5.4418 7.8749 6.0955 1.4579 1.4952 1.4308 5.7095 1.4960 4.9665 1.6090 2.4882 6.6681 1.6331 2.0815 3.8386 5.2536 3.4214 1.5511 1.6786 1.4102 1.4896 1.9205 1.3329 6.0992 5.0714 6.4059 3.0932 3.4736 3.5364 3.1444 5.3152 2.8983 2.6725 1.5458 1.7976 1.8448 1.8806 1.8251 2.0855 2.6699 1.8962 1.7992 1.6752 2.0671 2.7269 1.7051 2.4073 2.9342 3.0858 3.2357 3.3618 3.9575 3.0478 2.6918 2.1914 2.6712 2.6254 4.4880 3.8368 3.8515 3.6321 1.1864 4.9137 4.6576 2.7699 5.2340 2.6904 5.2665 6.8988 5.6965 6.4321 4.4028 4.4864 3.9762 5.6826 6.3810 6.3159 6.3267 5.8146 5.3373 7.5827 5.9549 7.4054 6.8648 6.2007 6.8020 7.6433 6.6207 6.7319 6.8960 7.0273 7.0740 8.6779 7.1312 8.0962 9.0498 7.7318 1.0812 1.0923 1.0920 1.0881 1.0926 1.0932 1.0909 1.0914 1.0948 1.0945 1.0990 1.0939 1.0944 1.0936 1.0911 1.0907 1.0685
irintensity: 0.4918 5.7396 0.3895 0.8162 6.3444 2.7730 7.0787 0.0574 1.3116 2.7175 1.7964 1.3628 3.9895 85.5045 5.2305 65.1833 51.6295 21.4754 19.1029 105.5682 12.0746 11.2265 33.1015 19.2803 11.3979 10.8668 21.4115 48.2441 3.3492 11.1346 2.6798 0.8916 7.0195 39.5576 2.5674 6.5699 0.1021 33.6066 4.1739 3.7777 9.7441 13.9207 9.5968 17.1246 23.5836 8.6789 1.9131 6.9104 26.1454 13.2841 2.8623 13.6423 16.7392 21.1871 24.0378 1.4299 20.2371 32.2636 33.4589 3.9911 10.3588 5.5267 0.6891 3.9029 20.5931 20.6856 0.4925 17.3595 1.7352 12.0851 6.8413 10.2871 4.8338 0.7196 0.3377 12.3785 7.0952 9.9843 32.4447 24.9242 5.8535 15.4365 6.5915 3.9315 1.7287 117.5126 15.0648 52.4565 12.6625 18.8101 5.8410 55.6469 15.3039 82.8385 5.7574 24.9051 30.0125 28.2801 6.2236 17.2808 3.9621 10.6473 45.5574 0.0054 61.1398 11.7662 60.0646 2.8269 17.7747 14.5044 68.0799 58.7570 33.3868 55.0808 46.4862 34.6861 569.7222 127.3676 105.5558 265.3639 151.7706 30.3488 3.9700 3.5960 58.0570 956.6471 667.4979 122.5854 138.2411 39.6800 93.7199 13.3607 2.9151 290.6359 137.7825 60.2461 167.5798 74.0820 196.7745 53.0963 86.3696 22.7483 71.5512 5.4979 15.1368 83.2818 11.1329 18.9004 38.0211 2.2539 18.7191 35.7199 88.0665 84.0949 29.6198 242.4406 185.6657 1215.0403 11.8472 270.8357 153.5038 5.4904 321.2910 396.1864 2289.2883 62.5140 21.6449 101.0977 45.2930 353.2682 142.9395 385.2549 167.3040 479.0365 2.1984 99.8261 3.5821 69.9159 53.6355 29.4931 10.0243 4.2104 2.4151 7.3447 29.6086 26.4537 9.2471 2.4340 50.5521 5.5200 19.0150 10.9334 21.7507 24.9720 136.3183
temp: 298.150 k
press: 1.00000 atm
elementType: 6 6 6 6 6 6 6 6 6 6 6 6 6 6 6 6 1 1 6 6 6 6 6 6 6 6 6 6 6 6 6 6 6 6 6 6 6 7 6 6 6 6 6 6 1 6 6 6 6 6 7 1 1 1 1 1 1 1 1 1 1 1 1 1 8 8 1
symmnumber: 1
zpe: 1309031.2 jmol-1
zpe.correction: 0.498584 hartree
zpe.thermalcorrener: 0.528213 hartree
zpe.thermalcorrenthalpy: 0.529157 hartree
zpe.thermalcorrgfe: 0.441515 hartree
zpe.sumelectzpe: -2021.881670 hartree
zpe.sumelectthermal: -2021.852041 hartree
zpe.sumelectthermalent: -2021.851097 hartree
zpe.sumelectthermalfe: -2021.938739 hartree
dipole: 0.5148 -11.4317 -1.9937
dipole: 11.6156
quadrupole: -221.3110 -166.2057 -278.1967
quadrupole: 35.6185 7.2119 15.7438
quadrupole: 0.5935 55.6987 -56.2922 35.6185 7.2119 15.7438
hfenergy: -2022.3802537 hartree
pointgroup: C01 [X(C46H17N2O2)]
dipole: 0.3269466 -4.4906414 -0.7820782 debye
polarizability: 1919.5078566|-128.2717068|1728.0903688|33.4442175|39.8306687|229.7629511 unknown
InChI: InChI=1S/C46H17N2O2/c49-50-28-11-20-8-19-10-22-13-47-14-26-23-4-3-16-1-2-17-7-18-9-21-12-48-15-27-24-5-6-25(28)38-33(20)42-35(19)39(29(22)26)43-36(23)31(16)32(17)41-34(18)40(30(21)27)44(37(24)38)46(42)45(41)43/h1-15,28,49H
charge 1 multiplicity 1
67 atoms
C  3.3263327 0.57701143 0.02273253
C  2.08153883 -0.11554904 -0.0388339
C  0.87355756 0.58716956 -0.05210351
C  0.87604608 2.01620014 -0.00393222
C  2.09279133 2.71264474 0.05378683
C  3.32270725 1.99820817 0.06716375
C  -0.3732798 -0.11381337 -0.11267189
C  -0.35601577 2.72609506 -0.01220296
C  -1.57414627 2.02544788 -0.06756572
C  -1.58609546 0.58602533 -0.11872936
C  -2.78931859 2.7356052 -0.06870965
C  -2.77337989 4.15572699 -0.0142188
C  -1.55655477 4.84909317 0.03779244
C  -0.34621399 4.16002625 0.0396007
C  0.90488153 4.83907267 0.09447189
C  2.09510423 4.15490298 0.10188498
H  0.90653412 5.92487 0.1332048
H  -1.55963126 5.9346866 0.07949726
C  2.06434908 -1.55300983 -0.08443364
C  0.8620121 -2.24942411 -0.14555559
C  -0.3815375 -1.54006742 -0.16480585
C  -1.58675232 -2.22893195 -0.22876271
C  -2.82276362 -1.53320279 -0.23430452
C  -2.82598363 -0.11155503 -0.17589348
C  -4.04640499 2.06544233 -0.12022754
C  -4.06861573 0.59452836 -0.18022928
C  -4.0496763 -2.23893526 -0.29924457
C  -5.2443284 -0.13543141 -0.24589387
C  3.29220971 -2.27223206 -0.06638988
C  4.5610435 -0.12813048 0.04138883
C  4.55190186 2.71010993 0.12773253
C  3.36816224 4.8402346 0.16001202
C  -5.18287137 2.84710457 -0.1092791
C  -4.02415349 4.82739378 -0.0130124
C  -5.23284898 -1.53571222 -0.30861792
C  4.53676173 -1.59696607 -0.00518715
C  5.74371833 1.99251762 0.144953
N  -5.18342505 4.20866242 -0.05726486
C  5.74670269 0.60164852 0.10381919
C  4.53048158 4.15554808 0.17191501
C  3.293202 -3.6947153 -0.11040797
C  0.87110288 -3.69264492 -0.18498098
C  -1.57389234 -3.68453919 -0.2631097
C  -4.07283641 -3.74913127 -0.37304479
H  -4.53148384 -4.07060196 -1.32024525
C  2.08278225 -4.39479188 -0.16797086
C  -0.33896909 -4.38284003 -0.23722753
C  -2.73315988 -4.40090623 -0.29583965
C  5.67916834 -2.38560038 0.00453633
C  4.53810306 -4.3690472 -0.09150715
N  5.69417595 -3.74060202 -0.03634982
H  -6.16912663 2.39939038 -0.1414933
H  -6.20582495 0.36368978 -0.25788273
H  -6.17601171 -2.06999824 -0.3653847
H  -2.71513089 -5.48699743 -0.27229739
H  -0.34444578 -5.46920122 -0.26338316
H  2.07854877 -5.48043553 -0.19967376
H  4.55479732 -5.45499243 -0.12444301
H  6.66127111 -1.92995996 0.04671991
H  6.70485557 0.09561132 0.12325355
H  6.68640368 2.52855922 0.19307873
H  5.48142354 4.67747472 0.21716804
H  3.36148447 5.92548336 0.19526522
H  -4.03943309 5.91391347 0.02855053
O  -4.95127245 -4.34026921 0.58826793
O  -4.41384989 -4.1022112 1.89110502
H  -4.89056322 -3.30561597 2.17563107
