program: Gaussian 09
title: combined_medium
version: ES64L-G09RevE.01
frameworkgroup: C1[X(C46H17N2O2)]
method: RwB97XD
basis: Gen
operation: Freq
keyword: #P
keyword: Geom=AllCheck
keyword: Guess=TCheck
keyword: SCRF=Check
keyword: GenChk
keyword: RwB97XD/ChkBas
keyword: Freq
converged: YES YES YES YES
title: Mulliken charges:
elementType: C C C C C C C C C C C C C C C C H H C C C C C C C C C C C C C C C C C C C N C C C C C C H C C C C C N H H H H H H H H H H H H H O O H
charge: 0.063984 0.046713 0.027359 0.018328 0.026595 -0.032905 0.096370 0.001207 0.076686 -0.038960 -0.106660 0.056905 -0.099572 0.061528 -0.206273 0.072646 0.203878 0.230219 0.004644 0.000602 -0.003935 0.015422 -0.024283 0.065259 0.072913 0.037644 0.070009 -0.155183 -0.006065 0.039605 0.059439 -0.162581 0.111685 0.057149 -0.209802 0.055478 -0.189760 -0.403342 -0.176017 -0.167152 0.049783 0.100317 0.085455 -0.170619 0.176079 -0.184110 -0.216338 -0.155271 -0.014985 0.044397 -0.486301 0.219814 0.184105 0.175879 0.180653 0.200392 0.210740 0.194628 0.187705 0.184529 0.181158 0.179285 0.181381 0.220307 -0.223473 -0.519869 0.424581
chargesum: 1.00000
title: Mulliken charges with hydrogens summed into heavy atoms:
elementType: C C C C C C C C C C C C C C C C C C C C C C C C C C C C C C C C C C C N C C C C C C C C C C C N O O
charge: 0.063984 0.046713 0.027359 0.018328 0.026595 -0.032905 0.096370 0.001207 0.076686 -0.038960 -0.106660 0.056905 0.130647 0.061528 -0.002395 0.072646 0.004644 0.000602 -0.003935 0.015422 -0.024283 0.065259 0.072913 0.037644 0.070009 0.028922 -0.006065 0.039605 0.059439 0.018801 0.331500 0.277455 -0.033923 0.055478 -0.008602 -0.403342 0.008512 0.012132 0.049783 0.100317 0.085455 0.005460 0.026629 -0.015946 0.025382 0.172721 0.239025 -0.486301 -0.223473 -0.095288
polarizability: 3.73973791e+03 -7.25829293e+02 1.63196161e+03 -1.39265114e+02 1.91724054e+01 2.46178932e+02
1716.lowfreq: -12.4579 -7.3122 -0.0005 0.0002 0.0007 7.5781 30.1775 43.5566 57.5307
frequency: 30.1469 43.5538 57.5280 64.0766 77.3337 90.5496 101.8551 127.8950 145.6882 166.7326 171.0810 193.9540 196.9162 221.7485 224.8554 252.5382 256.5054 258.6317 262.0157 274.4698 281.6787 290.7178 296.1362 315.6184 329.0255 341.8210 351.0027 355.7298 362.6731 369.3511 387.5584 396.4412 405.2867 414.3584 434.1619 448.9020 459.1915 466.4448 480.6970 484.6116 492.2382 513.5764 517.7245 524.1573 545.8957 550.6782 558.9599 561.2515 566.6646 572.6601 577.5389 584.7307 588.7138 603.1868 617.2687 620.2193 623.0515 628.8588 636.9037 637.9510 640.7801 643.3494 650.1138 666.1165 678.8861 688.5049 700.6976 701.1072 703.4747 728.8475 737.7836 741.7678 748.7042 757.4039 763.2149 778.4983 787.6394 789.9607 795.3908 802.7479 814.7690 820.7255 825.7654 839.2402 846.7862 856.3937 872.6331 878.8825 890.2052 895.7655 909.5610 925.5164 932.4682 943.3817 947.0679 954.5189 968.6863 973.3484 984.5679 993.7450 996.2108 999.3806 1006.0313 1006.3341 1018.5454 1020.7656 1043.2258 1051.1292 1072.4271 1102.1211 1111.6859 1148.1379 1159.2126 1163.3553 1178.5799 1182.8439 1195.5662 1198.8267 1205.6399 1213.4776 1222.1822 1230.5708 1245.3316 1245.9110 1258.4360 1261.1624 1275.2310 1280.0728 1297.4951 1314.4545 1321.6190 1339.8550 1348.4611 1350.0242 1365.2408 1372.8331 1376.7556 1396.6680 1398.3922 1403.9572 1411.3047 1422.0864 1425.1087 1435.3593 1442.6788 1446.0690 1451.3088 1453.9305 1464.5071 1467.7969 1474.8376 1481.3947 1485.0934 1491.5418 1498.9494 1507.0407 1522.8227 1529.7100 1531.5351 1544.8072 1551.1987 1556.0700 1584.2433 1588.0783 1600.2308 1608.9284 1620.6243 1631.4944 1631.8980 1645.0051 1655.5667 1666.2970 1670.3661 1685.4094 1686.0495 1695.7898 1701.1399 1711.7571 3227.7470 3231.3298 3232.9575 3234.5638 3235.7669 3237.1310 3240.0956 3241.8031 3242.4987 3245.9574 3247.6420 3248.4096 3250.6881 3260.2111 3263.6122 3272.9596 3796.4356
redmass: 7.5901 6.4908 6.6158 6.4729 6.5165 5.0892 5.6781 5.7768 5.6273 5.7521 4.6032 5.5428 5.8705 4.4593 6.6172 5.8628 5.0908 5.9811 5.2746 5.8313 6.5218 6.1210 4.3252 2.0605 2.5031 6.3322 5.2915 5.7850 5.5984 7.7440 5.7168 6.9038 6.1875 6.0725 5.6186 5.9023 5.6145 6.3566 4.0158 7.1437 4.1155 5.4283 5.5747 4.4970 4.5434 7.3491 4.3039 5.1979 5.5171 5.2046 7.2881 4.9564 6.7840 5.7682 6.6081 5.8937 6.7354 5.2536 6.8687 4.7938 6.1235 7.2331 5.5470 7.2576 7.1853 7.2633 7.2609 7.0343 7.6290 5.5989 6.0741 5.2459 6.9195 5.8824 6.4286 6.0399 6.1887 5.1376 5.6334 6.7694 6.0756 1.5634 1.4655 6.2574 4.3861 5.8326 1.5673 1.6352 4.9604 1.7114 1.4098 3.1980 1.9185 1.5881 4.1806 6.8907 1.6126 5.4375 5.3957 2.0716 1.5509 2.5153 1.3452 1.7175 1.3444 1.3549 5.0431 5.7224 5.3423 4.0215 3.7439 4.6803 1.7653 3.7852 2.4689 1.5343 1.9405 1.6223 2.0953 1.6565 1.8073 2.3553 2.2736 2.4157 2.8100 1.7676 2.3298 2.2975 2.4566 3.2555 4.0881 4.4260 3.7647 3.2939 3.0612 2.8017 2.7297 2.1691 1.2901 2.7075 3.1515 5.6516 5.0227 5.1061 5.9436 4.7873 3.0098 4.7977 4.6074 3.3233 4.3106 4.4792 5.2554 3.6953 5.3402 4.9943 5.8494 6.6766 6.5136 4.0366 6.1979 6.0783 5.3876 6.4100 7.4306 5.4361 7.2871 6.5462 6.2865 6.7329 6.7245 9.0861 9.6518 8.0836 7.2184 7.1755 7.1606 7.4552 1.0903 1.0929 1.0883 1.0929 1.0885 1.0933 1.0932 1.0912 1.0938 1.0935 1.0943 1.0990 1.0987 1.0943 1.0943 1.0919 1.0685
irintensity: 5.1908 1.5243 22.8598 7.0640 3.8640 4.6198 31.0724 5.1452 17.1387 70.0681 19.5855 22.8134 26.9707 32.3343 20.2677 180.1109 56.3710 310.8103 38.9341 0.5748 92.1591 89.0198 801.5094 119.2921 568.7701 533.0161 19.4646 59.0377 111.3880 69.8077 32.8488 101.5631 380.9762 36.3399 98.5002 26.5269 635.2350 199.8869 46.6183 5.6720 1056.3495 450.9783 401.1668 71.5217 10.2055 209.9984 104.5617 146.4642 6.0859 11.5979 9.9240 74.0345 6.2602 11.0234 38.2344 18.4018 38.1546 29.7636 505.3541 38.3008 489.2766 299.9563 64.1161 16.4937 545.4423 660.7651 8.6797 25.6918 263.7842 302.7466 9.7194 1045.8569 138.9372 146.8080 508.0402 184.2356 76.6952 26.6835 113.2033 321.0173 42.6082 97.5435 1.3256 176.9103 657.8127 11.3128 72.0365 95.7533 74.2435 1076.2894 13.8523 8.2309 146.2576 5.1025 100.6445 274.2907 71.4776 38.5637 21.1087 178.4390 1.1427 171.9104 4.6310 48.2478 1.2645 0.3557 920.0075 10.0083 2837.8831 4061.4663 3651.7690 1311.5431 9834.4897 2735.1928 440.3273 69.0062 295.0926 54.5331 970.6643 143.4617 571.5970 2896.6727 1323.3583 4237.6089 851.1091 1684.9540 3309.2514 270.4934 5063.1524 2068.3311 567.4639 33.8315 449.2526 94.6763 496.2336 266.1662 379.4474 215.0263 183.5005 100.5971 12.8191 230.3588 595.4256 181.2878 82.3216 435.7273 102.0729 53.8977 314.3687 243.1214 60.1559 372.3980 51.9139 925.8502 711.2175 529.9327 1185.1405 563.5635 10.2595 301.9771 1363.0629 409.8690 10.0772 4.1291 70.7616 780.5868 322.6872 99.6840 111.7199 797.5057 2444.7102 1014.7559 418.5029 316.4906 60.5938 1404.9330 673.4415 153.0058 1.4538 36.0559 2.1539 14.5899 0.7174 0.5729 12.4332 16.0091 41.1930 45.6767 34.0486 32.1785 37.2830 5.7490 81.8885 53.9529 255.3660
temp: 298.150 k
press: 1.00000 atm
elementType: 6 6 6 6 6 6 6 6 6 6 6 6 6 6 6 6 1 1 6 6 6 6 6 6 6 6 6 6 6 6 6 6 6 6 6 6 6 7 6 6 6 6 6 6 1 6 6 6 6 6 7 1 1 1 1 1 1 1 1 1 1 1 1 1 8 8 1
symmnumber: 1
zpe: 1304268.8 jmol-1
zpe.correction: 0.496770 hartree
zpe.thermalcorrener: 0.526508 hartree
zpe.thermalcorrenthalpy: 0.527452 hartree
zpe.thermalcorrgfe: 0.440303 hartree
zpe.sumelectzpe: -2021.860225 hartree
zpe.sumelectthermal: -2021.830488 hartree
zpe.sumelectthermalent: -2021.829543 hartree
zpe.sumelectthermalfe: -2021.916693 hartree
dipole: -1.3985 -4.6016 -2.5568
dipole: 5.4468
quadrupole: -223.7551 -129.3739 -284.8398
quadrupole: -3.9303 -13.3882 -5.6789
quadrupole: -11.0988 83.2824 -72.1836 -3.9303 -13.3882 -5.6789
hfenergy: -2022.3569951 hartree
pointgroup: C01 [X(C46H17N2O2)]
dipole: -1.5921607 -0.0262151 1.4340504 debye
polarizability: 1843.9509967|857.9726085|2453.2362909|470.4601973|1537.054829|1320.6911612 unknown
InChI: InChI=1S/C46H17N2O2/c49-50-46-16-48-14-24-12-22-10-19-3-1-17-5-7-25-26-15-47-13-23-11-21-9-20-4-2-18-6-8-27(46)36-30(18)32(20)38-33(21)37(28(23)26)40-35(25)29(17)31(19)39-34(22)44(45(24)46)41(36)43(38)42(39)40/h1-16,49H
charge 1 multiplicity 1
67 atoms
C  0.08179257 -6.4098437 -4.22633162
C  1.51414495 -6.31795523 -4.33712264
C  2.21492712 -5.29511883 -3.69336924
C  1.51476526 -4.33274922 -2.89708639
C  0.10509574 -4.41189212 -2.76929158
C  -0.61142196 -5.447556 -3.43892211
C  3.63441034 -5.20556877 -3.81212897
C  2.21796388 -3.31379629 -2.24370189
C  3.64233492 -3.212024 -2.38854264
C  4.33958477 -4.17043963 -3.1809252
C  4.3223645 -2.19075766 -1.74563798
C  3.62692598 -1.3120177 -0.8692334
C  2.24339308 -1.38196263 -0.73786284
C  1.50945804 -2.37070525 -1.43903502
C  0.11739897 -2.45950303 -1.31630887
C  -0.59841832 -3.46285925 -1.97519793
H  -0.41022224 -1.73986982 -0.6974112
H  1.72507966 -0.70016666 -0.06896096
C  2.22531091 -7.28336764 -5.10817723
C  3.62852763 -7.21954631 -5.21482194
C  4.34053266 -6.18523377 -4.56791469
C  5.74941041 -6.12715015 -4.66211977
C  6.4639949 -5.08640364 -4.01267033
C  5.76134696 -4.08940656 -3.27816002
C  5.75952776 -1.90706392 -2.00172835
C  6.48238844 -3.04237558 -2.66663161
C  7.88101297 -5.03319639 -4.11500566
C  7.87455532 -3.01590922 -2.77894056
C  1.51988178 -8.31589231 -5.76140266
C  -0.63233912 -7.43409746 -4.88020315
C  -2.0172 -5.51523008 -3.30921306
C  -2.026122 -3.56176957 -1.8640313
C  6.33479949 -1.50639238 -0.66847506
C  4.39102215 -0.47122525 -0.02993423
C  8.56607062 -3.9917142 -3.48227063
C  0.10664948 -8.41697126 -5.67527614
C  -2.70641249 -6.54512223 -3.97637869
N  5.69348641 -0.72775796 0.16461259
C  -2.0349269 -7.47464649 -4.73752375
C  -2.70443463 -4.54536656 -2.50628675
C  2.23183986 -9.27991284 -6.52285996
C  4.34221169 -8.2019124 -5.97619761
C  6.46101731 -7.12062442 -5.41852435
C  8.57434252 -6.04870813 -4.86946511
H  9.65661032 -5.99080018 -4.92805715
C  3.63306202 -9.21294209 -6.61884404
C  5.75866024 -8.12213464 -6.05443297
C  7.89990258 -7.04107143 -5.49143904
C  -0.49189194 -9.46478946 -6.35894583
C  1.48783171 -10.29516794 -7.16600518
N  0.17313816 -10.38987028 -7.09287229
H  7.29359421 -1.90473188 -0.35019335
H  8.43518759 -2.20644233 -2.32004117
H  9.64787635 -3.94505522 -3.55289152
H  8.42508043 -7.80102199 -6.06146791
H  6.29220158 -8.87360796 -6.62959612
H  4.16426174 -9.96077648 -7.20092071
H  2.00860626 -11.04501621 -7.75557778
H  -1.56690914 -9.59976041 -6.33748881
H  -2.61195298 -8.24810236 -5.22989299
H  -3.78634102 -6.6028159 -3.88321533
H  -3.78411147 -4.6196909 -2.42280325
H  -2.54720331 -2.83078179 -1.25418997
H  3.9407 0.33459696 0.53936012
O  5.91656618 -0.66240362 -2.80205847
O  5.29081067 -0.83910628 -4.07001176
H  4.37626675 -0.56204682 -3.90157842
