program: Gaussian 09
title: combined_medium
version: ES64L-G09RevE.01
frameworkgroup: C1[X(C46H17N2O)]
method: RwB97XD
basis: Gen
operation: Freq
keyword: #P
keyword: Geom=AllCheck
keyword: Guess=TCheck
keyword: SCRF=Check
keyword: GenChk
keyword: RwB97XD/ChkBas
keyword: Freq
converged: YES YES YES YES
title: Mulliken charges:
elementType: C C C C C C C C C C C C C C C C H H C C C C C C C C C C C C C C C C C C C N C C C C C C H C C C C C N H H H H H H H H H H H H H O H
charge: 0.020141 0.067409 0.038497 -0.047476 0.052198 -0.010860 0.034800 0.042049 -0.012798 0.057486 0.034593 0.042674 -0.156055 0.078702 -0.200512 0.065068 0.176486 0.185192 0.009666 -0.009051 0.041336 0.036124 -0.035078 0.082681 0.034362 0.007024 0.081772 -0.136032 0.025389 0.070662 0.055413 -0.156085 0.029178 -0.014799 -0.191527 0.046406 -0.201254 -0.489397 -0.193223 -0.176677 0.041044 0.091877 0.062481 -0.171919 0.186361 -0.138126 -0.155959 -0.141170 0.002749 0.051968 -0.476854 0.185601 0.191887 0.185584 0.193923 0.227110 0.229398 0.200914 0.192456 0.182029 0.175188 0.169612 0.170960 0.183879 -0.641326 0.415848
chargesum: 1.00000
title: Mulliken charges with hydrogens summed into heavy atoms:
elementType: C C C C C C C C C C C C C C C C C C C C C C C C C C C C C C C C C C C N C C C C C C C C C C C N O
charge: 0.020141 0.067409 0.038497 -0.047476 0.052198 -0.010860 0.034800 0.042049 -0.012798 0.057486 0.034593 0.042674 0.029137 0.078702 -0.024027 0.065068 0.009666 -0.009051 0.041336 0.036124 -0.035078 0.082681 0.034362 0.007024 0.081772 0.055855 0.025389 0.070662 0.055413 0.014875 0.214778 0.169081 -0.005943 0.046406 -0.026066 -0.489397 -0.011193 -0.007065 0.041044 0.091877 0.062481 0.014442 0.091272 0.071151 0.052753 0.195205 0.252883 -0.476854 -0.225478
polarizability: 1.94545209e+03 -1.04736122e+02 1.33652719e+03 -9.81102358e+00 1.32175342e+01 2.30130392e+02
1716.lowfreq: -11.7643 -5.4831 0.0001 0.0007 0.0010 8.0054 30.8724 43.9716 64.0669
frequency: 30.8264 43.9301 64.0586 66.8356 92.0920 111.0877 124.7899 163.9771 166.3751 183.5223 189.5096 227.4511 233.3164 242.5204 249.3760 256.1847 258.0631 268.5726 276.7838 293.4791 299.7997 313.5036 320.5908 329.4669 338.6701 354.1415 364.5453 372.8003 388.5307 393.4203 399.0555 410.1685 435.3583 451.8614 465.1810 467.9480 475.0958 483.6546 508.0521 514.0037 524.7456 543.2218 551.9805 553.2731 559.3048 564.8109 567.7582 578.6166 585.4240 590.2796 594.9973 609.6068 619.4050 622.2362 626.9440 630.8990 635.7463 637.3566 646.6734 662.4877 665.1896 687.8676 692.7763 700.1983 704.8224 717.6635 731.7423 738.9497 743.2324 750.8758 758.2204 775.6384 791.3783 793.4857 799.0515 808.6674 815.8340 819.5631 821.8837 831.8021 837.6674 843.2728 857.1820 873.9067 875.9448 888.7846 904.6097 919.3341 921.8240 939.1420 950.0362 951.8306 955.7488 962.0234 969.2371 984.8766 986.6092 994.9235 995.7097 1004.1163 1011.8622 1017.0111 1022.3881 1034.5467 1040.2479 1073.1895 1102.7001 1115.9802 1130.3843 1150.4254 1175.6210 1184.3626 1188.9238 1196.8685 1205.0190 1207.1118 1217.5715 1221.6634 1234.3264 1247.8867 1253.1164 1255.8597 1260.9893 1272.2296 1298.9092 1302.6603 1308.7944 1317.3395 1331.1301 1334.9125 1354.5868 1366.9740 1376.6491 1377.5676 1386.7738 1389.9087 1408.0991 1414.3516 1423.4640 1430.8674 1434.7417 1440.4867 1442.8283 1457.3548 1461.4104 1465.6704 1469.3804 1476.9637 1487.8619 1491.8805 1496.6668 1502.8037 1503.4468 1521.7832 1536.8688 1546.9339 1556.0929 1567.8249 1576.9565 1588.9778 1602.0619 1615.2163 1630.9061 1640.6402 1651.2695 1663.8921 1666.5211 1670.8689 1675.9828 1682.0916 1694.0909 1698.2087 1706.6937 1721.8541 1731.1500 3224.2546 3227.3887 3228.3485 3233.6639 3237.0964 3239.5124 3239.7906 3240.9913 3241.4805 3242.2413 3242.7727 3247.5257 3252.9143 3256.2511 3267.3452 3270.6977 3849.1302
redmass: 7.3834 6.1056 6.2833 6.3676 5.1729 5.1855 6.4092 4.6194 4.7466 4.8957 6.0514 6.5107 5.8173 6.4451 6.5844 4.3623 6.6339 5.6886 6.6428 6.6077 6.1365 4.1750 5.6044 1.9284 2.0577 6.3519 6.1230 6.0137 5.9446 4.9804 6.6024 6.5576 6.5480 5.8702 7.1261 5.7671 4.2737 6.8610 4.6767 5.0335 5.2140 4.2722 5.4219 6.5305 6.0310 4.6993 5.1968 6.6703 7.6121 4.7926 4.9362 7.1281 5.5853 6.5175 4.7876 7.0420 5.9236 5.9471 4.5462 5.9630 5.5381 7.4849 8.2590 6.1403 6.0524 4.4810 6.9281 6.8668 6.9393 5.3928 6.7882 6.5254 4.7797 6.9047 7.6100 5.7734 2.3151 3.0835 2.1587 3.4119 6.2561 6.1961 6.3518 1.5559 1.6330 6.0815 1.4526 1.4327 6.4919 1.5924 7.3316 7.7413 1.5944 1.5682 6.9233 6.7704 1.5632 1.4992 1.4110 1.5278 1.3438 1.3280 1.3719 4.7376 6.3594 4.9668 3.9403 3.5285 4.5030 4.2970 2.9483 1.4908 1.4363 2.1654 2.0199 2.3421 1.3548 1.7543 2.1962 2.3646 2.1620 2.2443 1.8219 2.1114 2.6779 3.8131 3.2313 3.1863 3.9663 2.4366 1.9159 3.3360 3.0172 2.7414 4.5735 3.7179 4.3419 3.5047 4.0916 4.4811 3.3050 5.0415 3.4561 3.7154 2.8567 3.6910 3.6877 6.0137 3.8737 4.5208 3.2943 3.5968 5.7092 5.8518 4.5119 4.5904 7.3301 5.8642 4.7496 7.3822 6.9653 6.0557 8.1672 6.7206 5.7914 8.9810 6.0272 8.5305 8.1909 6.7151 7.6190 7.3925 7.7855 8.0242 7.6300 1.0876 1.0926 1.0925 1.0909 1.0932 1.0913 1.0935 1.0992 1.0938 1.0894 1.0930 1.0920 1.0944 1.0988 1.0914 1.0942 1.0660
irintensity: 1.1414 0.0511 1.1913 1.2347 0.3830 4.6692 0.3559 0.3812 0.1710 2.8508 1.2770 4.1453 0.5522 9.9180 1.6471 0.0831 11.8831 2.9191 12.6670 1.6568 1.9539 0.1893 8.1157 132.8895 122.3557 7.2683 4.6484 5.3261 1.0309 8.1929 5.3619 2.9622 3.9224 6.4521 39.6796 35.7994 16.8970 24.0928 7.1374 16.0699 3.9606 1.9298 14.1965 9.4968 11.9297 4.5843 6.6505 11.2176 7.1750 18.8990 5.5303 14.9014 14.7707 6.5000 56.5568 2.3574 0.4568 1.7652 2.5551 9.3774 33.6089 8.6029 2.9406 10.1002 15.0646 8.7249 10.4019 18.9019 0.4882 1.4810 1.0459 5.9590 4.5239 2.0046 4.5625 3.3216 2.2676 10.1805 6.0785 15.7808 2.3664 27.9777 28.2665 50.3195 93.4997 95.3990 28.5868 5.3399 1.6067 8.1231 29.1538 178.9533 1.0942 97.4960 22.1502 68.9209 50.3221 11.6606 0.7189 8.1273 3.4200 0.1116 0.2142 83.3611 34.5040 5.1915 9.5574 83.9237 7.4667 117.5857 78.4809 205.4683 368.1966 87.8403 115.3177 326.9450 196.3958 69.1138 281.3490 859.4652 203.2580 243.6219 12.7061 120.5090 3.8419 1117.5551 221.5107 17.6505 18.3965 19.1156 129.1863 307.6627 249.9796 459.8677 104.6341 113.1217 953.6902 471.3425 1372.2658 184.9507 194.3474 47.3823 48.7790 115.0715 15.6317 5.9863 46.3808 55.0301 125.2469 317.7852 1.5974 15.6682 310.3522 7.9106 95.5062 83.0038 447.2843 130.2489 33.6751 54.1786 93.3473 90.8199 933.2647 1600.2098 16.4140 89.9909 96.2746 290.5791 282.1345 996.9180 292.5943 163.6281 61.2832 75.8914 37.8527 2.4357 20.0162 5.7077 19.1354 12.8280 24.3279 2.3327 40.3567 0.5181 1.5152 19.0828 3.2975 6.2287 24.0073 29.4308 23.7701 80.2835
temp: 298.150 k
press: 1.00000 atm
elementType: 6 6 6 6 6 6 6 6 6 6 6 6 6 6 6 6 1 1 6 6 6 6 6 6 6 6 6 6 6 6 6 6 6 6 6 6 6 7 6 6 6 6 6 6 1 6 6 6 6 6 7 1 1 1 1 1 1 1 1 1 1 1 1 1 8 1
symmnumber: 1
zpe: 1302512.3 jmol-1
zpe.correction: 0.496101 hartree
zpe.thermalcorrener: 0.524225 hartree
zpe.thermalcorrenthalpy: 0.525170 hartree
zpe.thermalcorrgfe: 0.441638 hartree
zpe.sumelectzpe: -1946.765331 hartree
zpe.sumelectthermal: -1946.737206 hartree
zpe.sumelectthermalent: -1946.736262 hartree
zpe.sumelectthermalfe: -1946.819794 hartree
dipole: -3.7353 13.0806 -1.3826
dipole: 13.6736
quadrupole: -220.3067 -141.3802 -277.6905
quadrupole: 20.7870 -2.3423 9.2452
quadrupole: -7.1809 71.7456 -64.5647 20.7870 -2.3423 9.2452
hfenergy: -1947.2614318 hartree
pointgroup: C01 [X(C46H17N2O1)]
dipole: 0.2125508 -4.8664622 -2.2830709 debye
polarizability: 1805.3612643|325.354649|1155.6585245|-38.5378038|516.3682804|551.0898875 unknown
InChI: InChI=1S/C46H17N2O/c49-46-24-11-20-4-2-18-6-7-25-27-15-47-13-22-10-21-9-19-3-1-17-5-8-26-28-16-48-14-23(12-24)30(28)44(46)42-37(26)31(17)33(19)39-34(21)38(29(22)27)40-36(25)32(18)35(20)45(46)43(40)41(39)42/h1-16,49H
charge 1 multiplicity 1
66 atoms
C  -1.59245251 -3.84656375 -1.81900658
C  -0.38074468 -4.3494624 -2.39046003
C  0.82562832 -3.63468054 -2.2487027
C  0.82976959 -2.38291579 -1.56064046
C  -0.30861845 -1.91527654 -0.95314874
C  -1.54654051 -2.64262228 -1.07492971
C  2.03081326 -4.18299969 -2.75316976
C  2.051166 -1.50837617 -1.64043896
C  3.31859329 -2.3000777 -1.84691444
C  3.29456038 -3.51038438 -2.50576255
C  4.56187792 -1.7185765 -1.48314993
C  4.58884055 -0.55762338 -0.66307486
C  3.34350854 -0.02337405 -0.13880204
C  2.14100806 -0.51844982 -0.50230527
C  0.90439637 -0.05739467 0.07819851
C  -0.27854871 -0.68647663 -0.15253335
H  0.94312944 0.79468574 0.75148352
H  3.40314742 0.77655425 0.59461083
C  -0.3887416 -5.57528884 -3.10404747
C  0.79830127 -6.09732161 -3.6302821
C  2.01876766 -5.41153174 -3.43338738
C  3.23570976 -5.98668109 -3.91374945
C  4.47572402 -5.34695983 -3.66388003
C  4.52012199 -4.1220092 -2.93198699
C  5.77759331 -2.30115535 -1.8835977
C  5.75907879 -3.51274827 -2.66093657
C  5.66973504 -5.93829565 -4.13878233
C  6.94639007 -4.12889032 -3.15613978
C  -1.60968197 -6.28060099 -3.28302192
C  -2.818195 -4.55054289 -1.97115256
C  -2.72284265 -2.14117649 -0.47425529
C  -1.51775709 -0.22720711 0.44640571
C  6.96943743 -1.64551993 -1.47529374
C  5.81363201 -0.02998334 -0.32456226
C  6.90356595 -5.29186417 -3.86962954
C  -2.82237013 -5.79474585 -2.74510377
C  -3.91396573 -2.84881748 -0.63421991
N  6.99670531 -0.55382077 -0.73476469
C  -3.96270833 -4.02764778 -1.36671303
C  -2.6688573 -0.90686427 0.29197951
C  -1.61968858 -7.49701699 -4.01425004
C  0.783702 -7.33668168 -4.35060635
C  3.21226 -7.2167781 -4.6313636
C  5.62202191 -7.16207085 -4.8722794
H  6.55401466 -7.58712215 -5.22974863
C  -0.42051246 -8.01287327 -4.54099993
C  1.9943461 -7.86193311 -4.8442834
C  4.43632634 -7.78256786 -5.1109802
C  -3.96412133 -6.55087461 -2.99420428
C  -2.85184343 -8.16316111 -4.18366457
N  -3.99203573 -7.70624923 -3.69430907
H  7.93779611 -2.04080068 -1.76152797
H  7.91072325 -3.67135663 -2.97176384
H  7.820459 -5.73945621 -4.23865732
H  4.393343 -8.71650723 -5.66156509
H  1.97660167 -8.79998554 -5.39236938
H  -0.43501057 -8.94854341 -5.09278516
H  -2.88468197 -9.09555308 -4.74020143
H  -4.92942963 -6.22869978 -2.62092381
H  -4.91457054 -4.53851439 -1.4522056
H  -4.82137545 -2.46836699 -0.17534955
H  -3.59007546 -0.55167136 0.74343153
H  -1.48640645 0.6875036 1.03075809
H  5.8751156 0.84875186 0.31010697
O  1.903892 -0.64872124 -2.81674501
H  1.75846665 -1.21292964 -3.58923704
