program: Gaussian 09
title: combined_medium
version: ES64L-G09RevE.01
frameworkgroup: C1[X(C46H17N2O)]
method: RwB97XD
basis: Gen
operation: Freq
keyword: #P
keyword: Geom=AllCheck
keyword: Guess=TCheck
keyword: SCRF=Check
keyword: GenChk
keyword: RwB97XD/ChkBas
keyword: Freq
converged: YES YES YES YES
title: Mulliken charges:
elementType: C C C C C C C C C C C C C C C C H H C C C C C C C C C C C C C C C C C C C N C C C C C C H C C C C C N H H H H H H H H H H H H H O H
charge: 0.055438 0.081830 0.014473 0.022793 0.029200 -0.021245 0.079663 0.025495 -0.049545 0.060846 0.078773 0.033824 -0.127407 0.055104 -0.223672 0.058209 0.190303 0.196912 -0.005830 0.020006 0.008548 0.018906 -0.005727 0.027013 0.052117 0.024814 0.060754 -0.164723 0.015638 0.057449 0.052755 -0.174770 -0.025979 0.092235 -0.198204 0.034797 -0.175184 -0.511798 -0.174952 -0.168735 0.041202 0.089573 0.077371 -0.165425 0.177759 -0.136302 -0.197147 -0.159584 0.028634 0.064858 -0.472617 0.171915 0.177773 0.177031 0.181451 0.210433 0.230113 0.207768 0.200409 0.186901 0.184985 0.179892 0.179606 0.185331 -0.661098 0.419045
chargesum: 1.00000
title: Mulliken charges with hydrogens summed into heavy atoms:
elementType: C C C C C C C C C C C C C C C C C C C C C C C C C C C C C C C C C C C N C C C C C C C C C C C N O
charge: 0.055438 0.081830 0.014473 0.022793 0.029200 -0.021245 0.079663 0.025495 -0.049545 0.060846 0.078773 0.033824 0.069505 0.055104 -0.033369 0.058209 -0.005830 0.020006 0.008548 0.018906 -0.005727 0.027013 0.052117 0.024814 0.060754 0.013050 0.015638 0.057449 0.052755 0.004836 0.145936 0.277566 -0.021173 0.034797 0.009801 -0.511798 0.011949 0.011157 0.041202 0.089573 0.077371 0.012334 0.093811 0.013285 0.021867 0.229043 0.272626 -0.472617 -0.242053
polarizability: 1.69653042e+03 3.04673861e+01 1.46092866e+03 -1.21806238e+01 6.24064216e+00 2.27569841e+02
1716.lowfreq: -16.2792 -3.3063 -0.0002 0.0005 0.0008 9.9764 33.5593 46.9658 63.9805
frequency: 33.5354 46.9561 63.9804 68.1860 90.4774 115.2953 133.7450 159.0691 165.3858 184.3968 193.4901 212.5579 229.4646 237.1075 250.3773 256.9846 259.4403 270.0418 282.7710 290.4833 295.0166 308.7712 319.2868 328.0640 334.9209 351.6995 367.6693 372.9622 383.3254 399.4974 402.1950 411.2448 439.7966 452.6909 462.2056 470.5954 476.5863 486.5875 509.9607 511.6303 530.5314 532.3411 543.6339 553.4571 559.5466 567.6136 570.4170 575.6059 578.4991 583.3799 588.6429 603.9707 616.9038 626.1886 629.6237 631.6168 637.0120 642.0369 651.0554 661.4215 668.6494 675.1953 686.2449 693.3946 701.2334 708.6980 714.1247 736.3396 740.4777 747.9488 754.8088 766.1857 781.4338 785.7619 798.8455 803.3934 810.0237 811.1260 827.9189 831.7436 834.5400 841.9166 852.6621 871.6856 880.1217 891.6436 912.8204 920.9547 922.7052 948.4442 951.6466 952.6167 962.0861 972.0480 980.2902 986.0082 991.6602 1004.9561 1007.8084 1009.5378 1015.1010 1020.2537 1023.3141 1034.0866 1045.2271 1066.2709 1090.3712 1112.9631 1126.0436 1152.4384 1171.0979 1178.2380 1183.9164 1187.8722 1197.5491 1203.3057 1212.1845 1219.3735 1234.6190 1237.4975 1250.4074 1250.9772 1262.7787 1274.8307 1291.7615 1292.9283 1322.1706 1331.7145 1335.3225 1345.2777 1347.9371 1355.1949 1370.6136 1380.4027 1387.4992 1397.5673 1409.9184 1414.7900 1419.1975 1419.8591 1436.8755 1441.7974 1448.2709 1449.6191 1457.8647 1462.7475 1470.4294 1475.8683 1483.6059 1486.5759 1495.1489 1499.3032 1514.7424 1521.1160 1531.5048 1546.0010 1555.3124 1571.5482 1582.2754 1596.9749 1606.2596 1610.7808 1616.4551 1632.9272 1647.9949 1663.5396 1665.8064 1678.2046 1682.6735 1686.5778 1692.4062 1698.0724 1709.0033 1711.7867 1730.0232 3207.5468 3225.8666 3234.0850 3235.7669 3236.7742 3240.8452 3241.2637 3241.9821 3242.3030 3243.3517 3244.2989 3250.0725 3252.2372 3257.1964 3261.5948 3275.9111 3847.7397
redmass: 7.2893 6.1336 6.3435 6.6151 5.3606 5.4208 6.6922 5.0634 4.8738 5.4416 5.0357 6.5720 7.1312 4.0845 6.0033 5.0592 7.2083 4.9187 5.3126 5.1234 6.1933 1.4301 5.7060 4.3260 4.5925 7.1400 7.5894 4.7932 5.8271 7.3616 6.0948 5.5494 6.1163 5.9241 5.7846 6.9679 3.9461 7.5530 5.0030 5.0468 5.0153 4.6722 6.8535 5.3616 5.0076 5.3237 5.8196 5.2917 4.6114 5.8739 5.7756 7.2936 6.6045 5.1990 6.3181 5.1104 4.4428 8.1463 4.8108 5.8300 8.0245 7.9874 6.8192 6.7628 7.1960 6.2862 5.7601 4.8982 6.6654 6.7560 6.6002 5.1280 5.3785 6.9082 8.0541 7.3949 6.3715 3.9040 1.9076 1.5299 7.1085 6.2125 6.3576 1.5495 1.5322 6.0221 2.1383 1.4498 2.5577 7.2543 1.5863 1.5185 6.7696 4.9729 1.8142 1.6161 5.5019 1.3505 1.3769 1.5985 1.5131 1.3484 1.3777 5.5206 5.7831 4.5613 3.9410 3.4903 3.1051 3.7367 2.8285 2.4203 1.4411 1.4845 1.6696 3.4407 1.5085 1.5575 2.7911 2.0751 1.9633 2.0711 2.0042 2.0085 3.2196 2.5594 3.4100 2.0946 4.2408 2.8173 2.4555 3.5753 2.6817 3.7768 3.6675 3.0995 2.2251 4.9652 3.0414 3.0211 7.0842 3.1593 3.0774 5.4722 2.9611 5.7338 3.2866 5.2661 4.7031 5.3701 4.1579 7.8437 5.9291 4.7265 5.5448 6.2549 4.9855 6.7640 6.0646 5.2826 6.4473 6.3430 8.7997 6.5772 6.3259 8.5283 8.9763 7.2077 6.5137 7.9015 7.5075 8.6516 7.2447 7.8772 7.3104 1.0920 1.0931 1.0928 1.0888 1.0883 1.0899 1.0935 1.0933 1.0913 1.0935 1.0924 1.0979 1.0991 1.0953 1.0947 1.0921 1.0665
irintensity: 1.2189 0.1460 2.3978 0.3080 0.2342 5.6957 0.1184 2.1226 1.9188 0.9117 1.7676 6.7324 4.1510 4.8082 9.3318 1.7969 2.4194 3.0233 9.2677 22.7381 1.9390 233.6717 17.7520 21.6461 37.1906 17.3969 6.7285 2.8474 1.4998 4.9792 5.2646 7.4937 3.2049 12.8254 13.2735 29.5728 0.4711 16.6831 14.2741 20.7216 0.9748 11.3177 6.2264 3.1370 5.5599 3.2971 4.5584 16.5820 11.3859 3.4762 0.4002 3.1556 17.1590 17.2342 4.7057 3.7346 18.7091 0.8214 9.7963 2.7451 1.9635 17.4367 10.3272 6.1729 6.4948 3.8961 4.5199 2.0680 11.6549 22.3403 7.8617 0.7286 5.8199 2.0957 22.1554 13.6414 0.2424 8.0046 11.8006 4.5624 33.5155 0.2600 3.6995 65.9543 72.0692 122.1846 36.4269 16.0355 14.5133 7.0291 3.2381 13.8770 86.1504 25.2663 99.9987 37.1240 261.8442 0.6615 0.7584 4.6766 3.1409 0.2053 1.1523 8.0513 6.4487 20.4001 107.9838 43.6016 133.0724 143.6700 8.4560 65.0225 162.0708 263.2924 72.0874 361.7456 182.4438 109.3639 439.6365 392.1953 481.1900 587.3891 187.2524 25.4654 32.4707 448.6304 1874.4608 546.5549 46.2702 704.5288 284.2638 159.1521 104.8969 165.7284 82.9906 547.8294 47.4356 46.6585 206.8665 346.0748 282.5108 70.5287 35.5037 23.6172 2.0676 39.9776 29.0281 52.4638 51.7393 49.9515 104.8906 18.7308 216.8906 164.4646 14.7555 11.7560 10.4671 74.9559 100.0546 15.0577 63.8495 344.5932 135.7058 374.9946 188.8033 164.4459 856.4087 532.5916 685.7385 835.4609 431.6335 114.3773 109.8922 69.0007 563.6479 31.0934 14.0599 16.9912 0.5385 0.8625 15.4945 7.5329 2.0086 11.0772 7.9678 11.8983 40.1976 34.2624 32.2121 0.2220 28.1861 93.9215
temp: 298.150 k
press: 1.00000 atm
elementType: 6 6 6 6 6 6 6 6 6 6 6 6 6 6 6 6 1 1 6 6 6 6 6 6 6 6 6 6 6 6 6 6 6 6 6 6 6 7 6 6 6 6 6 6 1 6 6 6 6 6 7 1 1 1 1 1 1 1 1 1 1 1 1 1 8 1
symmnumber: 1
zpe: 1301677.3 jmol-1
zpe.correction: 0.495783 hartree
zpe.thermalcorrener: 0.523950 hartree
zpe.thermalcorrenthalpy: 0.524894 hartree
zpe.thermalcorrgfe: 0.441432 hartree
zpe.sumelectzpe: -1946.779215 hartree
zpe.sumelectthermal: -1946.751048 hartree
zpe.sumelectthermalent: -1946.750103 hartree
zpe.sumelectthermalfe: -1946.833566 hartree
dipole: -10.7223 6.3707 -0.8774
dipole: 12.5030
quadrupole: -225.1218 -135.1407 -277.9357
quadrupole: 18.2454 -1.8880 6.1355
quadrupole: -12.3890 77.5920 -65.2030 18.2454 -1.8880 6.1355
hfenergy: -1947.2749973 hartree
pointgroup: C01 [X(C46H17N2O1)]
dipole: -2.9909862 -3.7028996 -1.2407644 debye
polarizability: 1646.1522133|174.2219686|1138.3741308|-180.3265192|535.952047|600.50258 unknown
InChI: InChI=1S/C46H17N2O/c49-46-24-12-22-10-20-4-1-17-5-7-25-27-15-47-13-23-11-21-9-19-3-2-18-6-8-26(28(46)16-48-14-24)37-31(18)32(19)39-34(21)38(29(23)27)41-36(25)30(17)33(20)40-35(22)45(46)44(37)43(39)42(40)41/h1-16,49H
charge 1 multiplicity 1
66 atoms
C  -1.82116004 -3.66147162 -1.51159323
C  -0.58652485 -4.127722 -2.06683938
C  0.61587351 -3.38875746 -1.88188801
C  0.59426482 -2.18198128 -1.13869229
C  -0.62470226 -1.71536227 -0.56806184
C  -1.82727141 -2.45034078 -0.75955801
C  1.83277864 -3.85970316 -2.42086712
C  1.77769642 -1.44173603 -0.97837211
C  2.97287739 -1.89224597 -1.5774163
C  3.02467233 -3.10755504 -2.24695163
C  4.16926295 -0.97039652 -1.60911998
C  4.1845212 -0.01632263 -0.44639241
C  3.03543072 0.38124351 0.13624093
C  1.76474087 -0.2574883 -0.16586874
C  0.59054961 0.17425335 0.39440902
C  -0.63396168 -0.5253608 0.18801719
H  0.5865319 1.05918251 1.02449506
H  3.0496586 1.15398817 0.90110282
C  -0.54933391 -5.32778589 -2.80412847
C  0.66765625 -5.80069277 -3.35260995
C  1.85646978 -5.07664136 -3.16403249
C  3.07049641 -5.55250063 -3.72017896
C  4.28241952 -4.82240137 -3.52441408
C  4.28096754 -3.61249068 -2.78306158
C  5.47162567 -1.71707407 -1.71938779
C  5.4877375 -2.93584602 -2.54386334
C  5.4932768 -5.32934295 -4.06197328
C  6.67192174 -3.44874745 -3.09844206
C  -1.7402674 -6.06303752 -2.99761397
C  -3.01838366 -4.38733251 -1.6960249
C  -3.02896925 -1.97257503 -0.19669101
C  -1.8588078 -0.06693607 0.74865202
C  6.56397961 -1.21698422 -1.10732768
C  5.46919899 0.48494759 -0.00888568
C  6.67720979 -4.61430914 -3.84034124
C  -2.97128982 -5.62176585 -2.46380247
C  -4.21601785 -2.7188333 -0.40130746
N  6.60211972 -0.0592098 -0.31424384
C  -4.21287503 -3.88306752 -1.12379911
C  -3.01733796 -0.76559382 0.55912246
C  -1.70767259 -7.27072121 -3.74324235
C  0.69053072 -7.01856755 -4.10398196
C  3.09037295 -6.77097615 -4.46731405
C  5.48241658 -6.55468978 -4.81864763
H  6.42326746 -6.9118961 -5.22533994
C  -0.49606244 -7.73287419 -4.28633706
C  1.91092721 -7.47753198 -4.64671688
C  4.3368741 -7.2442412 -5.01525415
C  -4.08773912 -6.42315756 -2.71548162
C  -2.91305575 -7.97771171 -3.9177173
N  -4.07336623 -7.57071971 -3.42075556
H  7.52316111 -1.71666187 -1.18722429
H  7.60423664 -2.91223779 -2.96035547
H  7.60684823 -4.98336788 -4.26181971
H  4.3277364 -8.16907169 -5.58287104
H  1.91861258 -8.40413977 -5.21332261
H  -0.48548488 -8.65877779 -4.85495207
H  -2.91421742 -8.90464716 -4.4842393
H  -5.06330826 -6.14251527 -2.33534972
H  -5.14669536 -4.41697221 -1.24945258
H  -5.14378993 -2.35396555 0.02852446
H  -3.95067444 -0.41207311 0.98612009
H  -1.85501303 0.84937627 1.33042213
H  5.48240425 1.3502249 0.65171854
O  4.01535158 -0.10527356 -2.7736862
H  4.06951152 -0.64652208 -3.57341741
