program: Gaussian 09
title: combined_medium
version: ES64L-G09RevE.01
frameworkgroup: C1[X(C46H17N2O)]
method: RwB97XD
basis: Gen
operation: Freq
keyword: #P
keyword: Geom=AllCheck
keyword: Guess=TCheck
keyword: SCRF=Check
keyword: GenChk
keyword: RwB97XD/ChkBas
keyword: Freq
converged: YES YES YES YES
title: Mulliken charges:
elementType: C C C C C C C C C C C C C C C C H H C C C C C C C C C C C C C C C C C C C N C C C C C C H C C C C C N H H H H H H H H H H H H H O H
charge: 0.063145 0.037501 0.028814 0.013192 0.022951 -0.035421 0.091701 0.011028 0.065525 -0.041026 -0.087421 0.056466 -0.102433 0.060496 -0.214302 0.076384 0.199841 0.229612 0.006475 -0.005447 -0.003938 0.002851 -0.018488 0.052567 0.090929 0.033506 0.069089 -0.156850 -0.014776 0.036055 0.060519 -0.163833 0.147492 0.083557 -0.213979 0.061631 -0.195162 -0.396095 -0.180071 -0.167751 0.053741 0.105646 0.092084 -0.170708 0.173531 -0.205863 -0.233035 -0.158775 -0.031394 0.036538 -0.492007 0.224841 0.181901 0.173833 0.177389 0.192584 0.201304 0.189250 0.182398 0.181948 0.178550 0.177246 0.179111 0.230742 -0.670053 0.424862
chargesum: 1.00000
title: Mulliken charges with hydrogens summed into heavy atoms:
elementType: C C C C C C C C C C C C C C C C C C C C C C C C C C C C C C C C C C C N C C C C C C C C C C C N O
charge: 0.063145 0.037501 0.028814 0.013192 0.022951 -0.035421 0.091701 0.011028 0.065525 -0.041026 -0.087421 0.056466 0.127179 0.060496 -0.014460 0.076384 0.006475 -0.005447 -0.003938 0.002851 -0.018488 0.052567 0.090929 0.033506 0.069089 0.025051 -0.014776 0.036055 0.060519 0.015279 0.372333 0.314299 -0.040145 0.061631 -0.016613 -0.396095 0.001878 0.009495 0.053741 0.105646 0.092084 0.002822 -0.004559 -0.040451 0.018614 0.151004 0.225788 -0.492007 -0.245191
polarizability: 3.30728648e+03 -6.17375650e+02 1.52009895e+03 -5.12751717e+01 -3.83585325e+00 2.25050988e+02
1716.lowfreq: -4.6489 -3.1864 -0.0005 -0.0004 0.0004 8.9376 33.3005 47.1333 64.1197
frequency: 33.2388 47.1211 64.1102 66.4478 88.9655 107.5393 131.7709 144.3706 166.6940 176.7939 193.7706 208.5890 221.1511 225.4907 250.3256 258.1933 260.1028 267.2015 271.4627 280.1509 290.6566 301.9980 309.7342 323.9058 349.2631 353.5098 356.2257 368.0251 382.9057 389.5460 408.5801 415.9404 421.5260 449.7094 454.7810 466.3348 473.4996 481.1324 485.6942 500.0642 515.7068 523.1959 546.2609 553.1905 560.5211 561.4754 569.3448 573.6285 578.3585 584.5483 589.5847 607.8692 617.5384 621.5048 626.3236 628.4945 633.7740 637.8719 641.3400 642.5198 645.3016 672.1902 679.7243 694.5086 698.7950 703.8655 707.1783 733.8679 738.3592 745.1406 758.0625 762.0322 776.2778 787.4586 792.3782 795.8541 800.2358 807.8846 820.1532 824.0051 829.7291 841.6755 855.6038 871.9074 880.8635 883.4678 892.6854 903.5603 911.9068 928.7870 938.4159 940.1128 951.3246 956.0620 960.5993 975.6006 989.8594 991.8501 999.8217 1002.4197 1018.3738 1019.3656 1022.6802 1040.9481 1056.6983 1072.1695 1084.4136 1112.7937 1124.6887 1152.6406 1168.0368 1170.0396 1180.7192 1191.7677 1198.9929 1202.3389 1211.6849 1216.4603 1224.4696 1237.5846 1248.0294 1255.3238 1265.1404 1267.7896 1281.7828 1305.7681 1314.3560 1322.7854 1330.9179 1341.7852 1342.9697 1352.8735 1363.8621 1372.6261 1378.3439 1396.3468 1407.5285 1410.4104 1418.6286 1433.9304 1437.7310 1440.9202 1444.2257 1449.7909 1453.4741 1465.0543 1468.0608 1474.1928 1480.3397 1481.7200 1491.2877 1500.9946 1508.2469 1527.6050 1531.4414 1537.4524 1548.5406 1553.8855 1568.6386 1582.9323 1589.5039 1603.8590 1614.1231 1628.1159 1637.9056 1644.9375 1650.1598 1658.1109 1671.9650 1678.9505 1685.3307 1690.3581 1701.1095 1707.8938 1717.1628 3225.3393 3227.0171 3230.0914 3230.4975 3233.2013 3233.7323 3237.7822 3240.5898 3240.6477 3244.0156 3245.8147 3246.2954 3249.1028 3256.6433 3259.6921 3271.0211 3841.0972
redmass: 7.2977 6.1097 6.2170 6.6117 4.9515 5.0386 6.0108 4.3189 5.0149 4.8317 4.8608 3.9290 6.9958 6.3067 4.9135 3.4527 5.1869 6.2358 1.9829 4.3366 6.0603 5.0395 4.8410 5.3892 7.3463 6.2832 4.6554 7.1140 5.9242 6.4428 6.2609 6.8833 5.9412 5.5308 5.1135 5.7377 4.5224 4.1822 6.2063 4.5702 5.0646 4.5787 4.4487 8.2446 4.4052 4.9225 5.4747 5.2720 7.1196 4.8253 7.6337 5.5268 6.3556 5.4922 4.8880 6.9271 5.3521 6.3640 5.0496 7.3272 6.0865 6.9720 7.0507 7.7499 7.3864 6.7531 6.6570 5.5128 6.8742 6.3648 6.1129 6.3702 6.5871 6.6623 4.8281 6.4725 7.2213 7.3322 1.8590 1.4816 3.8401 6.4571 6.1016 1.5661 1.5817 3.6478 3.0856 1.4042 1.5278 7.2028 1.5730 1.7107 7.3133 5.4951 1.6040 6.5801 1.5473 1.6747 1.4267 1.3417 1.3601 1.3474 3.7496 4.5512 5.1740 4.3158 3.1363 3.6432 3.3452 4.7613 2.7623 1.7769 1.4362 1.8460 1.6509 1.8431 1.6091 2.1950 2.3284 2.5951 2.1458 1.9009 1.9787 2.1043 2.1710 3.0158 3.5758 3.0644 2.2908 3.2850 4.1287 2.9154 3.1116 2.4412 2.8629 3.5765 2.2703 3.0972 5.1795 4.8998 5.0423 7.4838 4.3088 3.2160 3.3010 3.4247 4.4914 4.5936 6.6746 3.7591 3.4898 5.7135 4.5850 6.5336 5.8946 7.2827 4.9271 6.3318 6.0314 5.7373 7.0099 7.9233 5.0320 7.1951 6.4102 7.0152 6.0677 8.0318 8.8081 9.7474 8.0433 7.1461 7.1133 7.7995 7.5948 1.0926 1.0903 1.0923 1.0886 1.0930 1.0883 1.0931 1.0925 1.0911 1.0940 1.0954 1.0991 1.0988 1.0947 1.0945 1.0915 1.0664
irintensity: 1.3542 0.3404 5.2012 9.7157 2.7183 24.6259 22.0687 28.1404 5.5476 67.7499 8.9188 16.4040 8.3764 36.5204 73.4584 46.8761 4.3940 71.2165 293.7366 69.9769 14.2537 80.8740 202.8521 50.0501 118.5336 36.0446 32.5407 106.6469 72.4286 12.7905 197.4335 98.5096 14.3944 318.5986 504.3551 117.2132 122.8468 86.4173 7.0593 405.9697 70.9012 58.4229 6.4312 59.5430 26.5110 99.1634 3.4117 12.5581 25.4467 61.5274 5.0796 66.5286 67.0651 63.0805 103.4245 25.3674 35.2993 236.4002 17.7978 113.2789 193.1719 55.8922 252.6235 23.9091 106.2850 33.5473 47.6282 15.7509 4.8640 123.7287 1.5257 5.2384 40.2965 6.1111 8.3442 138.5560 355.7419 87.1852 65.1335 1.0496 3.6723 37.9564 17.5684 67.4892 382.6861 606.3214 713.5899 14.4467 476.5604 12.3176 3.6391 513.9761 84.1302 24.8123 75.9840 44.3695 8.1233 232.8121 22.5751 2.8566 6.0020 0.2957 32.6957 439.5021 25.6947 799.6700 51.7988 566.2034 2458.1770 13.8569 28.2577 4674.2205 336.3003 177.2187 118.1378 271.1003 24.1070 14.6853 58.8261 1550.6644 1023.8720 277.4112 901.4392 199.9798 1595.4201 1894.5461 2290.4260 3912.1160 506.0751 336.4253 195.7886 272.0672 542.8023 45.9668 1146.2238 326.0265 229.3961 7.6598 338.9202 533.6803 22.6203 228.7448 391.8112 98.7096 44.9948 647.2888 26.0097 45.4660 498.7440 50.4748 308.2354 508.8295 180.4203 890.6089 180.1258 19.3315 48.9397 407.7364 2533.5610 3.8608 51.7805 51.5515 1029.7255 135.1407 13.3671 853.4865 32.4510 1746.0724 567.4730 392.3572 218.2671 17.9890 384.3000 983.0166 204.3891 36.9772 14.4737 14.7066 0.9197 2.2443 0.1656 5.1037 19.9731 12.7605 16.6554 17.9317 36.8320 36.5690 91.8797 10.0536 47.8070 80.6550
temp: 298.150 k
press: 1.00000 atm
elementType: 6 6 6 6 6 6 6 6 6 6 6 6 6 6 6 6 1 1 6 6 6 6 6 6 6 6 6 6 6 6 6 6 6 6 6 6 6 7 6 6 6 6 6 6 1 6 6 6 6 6 7 1 1 1 1 1 1 1 1 1 1 1 1 1 8 1
symmnumber: 1
zpe: 1296547.2 jmol-1
zpe.correction: 0.493829 hartree
zpe.thermalcorrener: 0.522324 hartree
zpe.thermalcorrenthalpy: 0.523268 hartree
zpe.thermalcorrgfe: 0.439083 hartree
zpe.sumelectzpe: -1946.753904 hartree
zpe.sumelectthermal: -1946.725409 hartree
zpe.sumelectthermalent: -1946.724465 hartree
zpe.sumelectthermalfe: -1946.808650 hartree
dipole: 4.9843 -4.6548 -0.7992
dipole: 6.8665
quadrupole: -211.7767 -137.0356 -275.2789
quadrupole: 1.7677 -6.2483 -0.4643
quadrupole: -3.7463 70.9948 -67.2485 1.7677 -6.2483 -0.4643
hfenergy: -1947.2477326 hartree
pointgroup: C01 [X(C46H17N2O1)]
dipole: 0.0086435 1.9941957 1.8223914 debye
polarizability: 1714.6131553|745.3710906|2172.5388987|396.9238468|1345.9422956|1165.2843589 unknown
InChI: InChI=1S/C46H17N2O/c49-46-16-48-14-24-12-22-10-19-3-1-17-5-7-25-26-15-47-13-23-11-21-9-20-4-2-18-6-8-27(46)36-30(18)32(20)38-33(21)37(28(23)26)40-35(25)29(17)31(19)39-34(22)44(45(24)46)41(36)43(38)42(39)40/h1-16,49H
charge 1 multiplicity 1
66 atoms
C  -0.04725201 -6.47580773 -4.42074201
C  1.38554729 -6.3819787 -4.53364188
C  2.08430951 -5.36438675 -3.89100697
C  1.38358909 -4.40312126 -3.08818008
C  -0.02326161 -4.48477667 -2.95604561
C  -0.74030009 -5.51898585 -3.6280505
C  3.50970634 -5.27427548 -4.01041042
C  2.08736453 -3.38363608 -2.4330684
C  3.51366962 -3.27822144 -2.58537324
C  4.21407366 -4.24359295 -3.3828463
C  4.19081067 -2.26578377 -1.94537974
C  3.494366 -1.38472045 -1.0707816
C  2.11102846 -1.45298195 -0.93024663
C  1.37893551 -2.4451577 -1.62424082
C  -0.01574364 -2.53881318 -1.4964374
C  -0.72767631 -3.53873974 -2.15417205
H  -0.54186357 -1.82130004 -0.87390242
H  1.59615873 -0.76848363 -0.26181516
C  2.09648946 -7.35167 -5.31069982
C  3.49867496 -7.2920454 -5.41566682
C  4.21451615 -6.25794291 -4.76496364
C  5.62123191 -6.20620768 -4.8526868
C  6.33684485 -5.16987716 -4.19944074
C  5.63501331 -4.16799336 -3.47194508
C  5.63407638 -1.95698553 -2.22796343
C  6.36123976 -3.12256948 -2.85448029
C  7.75755805 -5.12655159 -4.28760218
C  7.74985124 -3.1089323 -2.95193439
C  1.3897726 -8.38034805 -5.9658687
C  -0.76320485 -7.49844814 -5.07760705
C  -2.14706475 -5.58994839 -3.49487685
C  -2.15723094 -3.64305222 -2.03929432
C  6.21725489 -1.52941164 -0.89914633
C  4.26219334 -0.51522623 -0.27005504
C  8.44245834 -4.09493156 -3.64944736
C  -0.02635378 -8.48067498 -5.88026803
C  -2.83532476 -6.61495277 -4.16297485
N  5.5732798 -0.75003292 -0.07846982
C  -2.16219524 -7.54113642 -4.93140776
C  -2.8342798 -4.6235222 -2.6834072
C  2.10003977 -9.34394513 -6.72985773
C  4.21120214 -8.27610172 -6.17696207
C  6.33236658 -7.20616601 -5.60752234
C  8.44992934 -6.14847129 -5.03940593
H  9.53315824 -6.09819991 -5.08842507
C  3.5006972 -9.2821107 -6.82344979
C  5.63120515 -8.200624 -6.24747866
C  7.77443156 -7.13350333 -5.6684051
C  -0.6273811 -9.52100414 -6.56675396
C  1.35064009 -10.35533596 -7.3774484
N  0.03765698 -10.44607797 -7.3058917
H  7.18564503 -1.90333121 -0.5783647
H  8.31627741 -2.30366813 -2.49291644
H  9.52533468 -4.05574656 -3.7083228
H  8.29954546 -7.89592748 -6.23544225
H  6.16415184 -8.95407115 -6.8207031
H  4.0303659 -10.03059554 -7.40601073
H  1.87010217 -11.10463774 -7.9692654
H  -1.70252709 -9.6541915 -6.54694047
H  -2.7400272 -8.31378356 -5.42434144
H  -3.91489454 -6.67576856 -4.06742465
H  -3.91358033 -4.70103413 -2.59727304
H  -2.67762312 -2.91589766 -1.42418453
H  3.81496126 0.31248741 0.2704608
O  5.74065872 -0.78375201 -3.07185667
H  5.30560926 -0.99092496 -3.91073242
