program: Gaussian 09
title: combined_medium
version: ES64L-G09RevE.01
frameworkgroup: C1[X(C46H18N2O2)]
method: RwB97XD
basis: Gen
operation: Freq
keyword: #PGeom=AllCheck
keyword: Guess=TCheck
keyword: SCRF=Check
keyword: GenChk
keyword: RwB97XD/ChkBas
keyword: Freq
converged: YES YES NO YES
title: Mulliken charges:
elementType: C C C C C C C C C C C N C C C C H H C C C C C C C C C C C C C C C C C C C C C C C C C C H C C C C C N H H H H H H H H H H H H H H O O H
charge: 0.053584 0.027949 0.034658 0.013318 -0.010305 -0.031678 0.078773 -0.009167 0.040749 0.016827 0.233537 -0.401815 -0.002956 0.073256 -0.251571 0.107806 0.186034 0.231584 0.008818 -0.009748 0.002225 -0.011520 -0.035223 0.043994 0.080431 0.048684 0.069655 -0.187733 -0.026160 0.049663 0.057651 -0.174125 -0.195468 0.068457 -0.212583 0.069884 -0.205556 -0.160843 -0.199092 -0.163384 0.059038 0.112046 0.097784 -0.172942 0.171722 -0.228108 -0.254400 -0.163914 -0.047258 0.029146 -0.497382 0.208979 0.198172 0.179986 0.173690 0.173774 0.183347 0.190992 0.183569 0.176801 0.176860 0.174529 0.173096 0.172723 0.227451 -0.880904 -0.511026 0.383619
chargesum: -0.00000
title: Mulliken charges with hydrogens summed into heavy atoms:
elementType: C C C C C C C C C C C N C C C C C C C C C C C C C C C C C C C C C C C C C C C C C C C C C C C N O O
charge: 0.053584 0.027949 0.034658 0.013318 -0.010305 -0.031678 0.078773 -0.009167 0.040749 0.016827 0.233537 -0.401815 0.228628 0.073256 -0.065536 0.107806 0.008818 -0.009748 0.002225 -0.011520 -0.035223 0.043994 0.080431 0.048684 0.069655 -0.007746 -0.026160 0.049663 0.057651 -0.001402 0.002704 0.295908 -0.038893 0.069884 -0.031026 0.048137 -0.022232 0.009712 0.059038 0.112046 0.097784 -0.001220 -0.037115 -0.071054 0.009860 0.129542 0.212715 -0.497382 -0.880904 -0.127407
chargesum: 0.00000
polarizability: 2.24140091e+03 -5.34176938e+02 1.75330105e+03 -6.70025516e+01 5.82961726e+01 2.26416486e+02
1716.lowfreq: -16.1266 -9.6721 0.0003 0.0007 0.0010 9.5415 25.0738 28.9346 36.4443
frequency: 25.0007 28.8634 36.3738 47.9501 61.8574 62.9094 75.7069 80.0360 95.3025 97.8695 110.8405 141.0899 165.1316 171.7469 186.4294 214.7472 232.4934 244.9223 252.6779 253.1951 263.0412 276.3580 283.2278 298.6395 317.3797 327.7836 344.3633 346.7693 353.4757 369.7204 382.8665 391.2349 401.4008 401.8386 428.0957 432.6215 449.5476 468.8156 472.5491 478.5890 488.9230 503.2445 514.2047 539.6655 541.6569 551.3072 555.4779 559.7045 569.1112 570.2637 579.4524 581.1527 585.5324 589.2711 605.9426 619.5397 622.4452 622.8394 632.2954 636.3243 637.5827 639.8381 653.0126 654.8091 674.6293 695.8947 696.4517 701.5805 706.7311 718.2601 731.2004 747.7832 753.0829 759.0889 759.4970 773.3595 778.7972 787.1228 796.8466 808.0172 808.2033 811.4090 822.0517 827.5111 839.3265 845.2215 860.7594 865.9100 875.5468 879.4785 896.2261 897.4008 909.7750 912.0578 930.5261 931.4266 932.4830 949.7249 950.7169 971.8980 980.5230 983.4219 995.5251 997.3846 1003.5971 1021.4661 1022.5236 1038.7874 1050.0478 1071.7354 1105.5851 1115.6349 1131.6289 1146.3658 1162.2747 1175.6032 1180.9807 1182.5601 1198.9213 1204.7655 1215.0244 1226.5909 1235.4091 1244.7196 1251.9151 1253.6310 1263.4890 1268.3941 1283.5835 1297.6340 1308.4088 1324.4510 1330.3101 1338.4609 1344.1857 1351.5324 1354.0708 1375.4528 1378.3313 1395.4699 1404.1301 1406.5859 1414.0841 1424.0905 1427.9413 1434.8583 1441.6079 1447.7789 1455.8185 1463.0391 1465.8093 1469.1983 1480.2567 1488.5725 1490.7186 1497.5130 1510.1201 1522.3403 1529.7790 1535.7984 1549.0213 1554.7442 1568.4577 1581.2470 1588.6078 1609.5295 1615.8545 1631.5791 1643.2288 1651.3521 1656.6954 1658.3110 1674.6487 1679.3181 1691.3972 1699.2070 1706.5311 1716.6298 1719.6678 1725.8774 3222.2430 3229.6936 3230.1635 3230.9087 3233.3998 3236.7987 3240.5299 3241.2744 3246.1542 3246.2102 3255.7945 3263.3016 3265.9930 3267.7004 3277.9410 3293.0251 3297.2294 3868.1929
redmass: 10.7676 9.9228 8.3959 6.0840 6.6374 6.0440 11.0794 11.4660 5.1500 5.1865 4.8060 6.1068 4.5300 4.4724 5.0943 5.7660 6.7245 4.5967 6.9584 6.1819 4.9797 6.3973 8.8458 5.9764 4.0890 6.3293 5.6899 8.0172 4.6352 7.8956 5.2381 6.3644 5.8751 7.2596 4.4871 1.1619 5.8792 5.7770 7.1728 3.8289 7.6925 3.7473 4.9941 4.2827 4.8435 7.0534 7.4313 4.3476 5.2624 3.8690 4.9836 7.4787 4.4198 8.7772 7.4930 5.3025 4.8658 6.5473 4.2507 6.9029 4.3564 8.7582 4.3859 9.8619 8.6504 7.8780 5.8803 7.2449 7.8638 5.1182 4.6807 7.2944 4.3585 4.3561 6.4444 6.3575 2.7741 4.1402 4.6969 6.9985 2.6956 6.7368 1.4697 1.6845 7.7323 6.2360 6.2468 1.5081 1.5024 1.6087 1.4074 5.9026 15.3950 1.6395 1.5607 1.4828 7.7895 1.6275 7.1737 7.2117 6.9895 1.5430 1.3757 1.3537 1.3552 1.3211 1.3235 5.3205 5.9811 4.6967 3.3532 3.0936 2.4297 4.3991 2.6074 1.4407 1.4106 1.6096 2.3045 1.5601 1.9374 2.0375 2.2451 2.2866 1.6461 1.7641 2.0938 1.9067 1.0968 2.5520 3.5471 2.9164 3.1960 3.5631 4.2761 2.9366 3.5561 2.6968 2.8349 3.0599 2.9504 5.7286 3.3876 5.6187 4.3191 4.5443 4.6810 6.1955 2.4275 3.7729 3.6260 4.9212 4.9708 4.0936 4.0750 4.1504 4.3689 4.6649 6.6775 6.2367 6.4746 6.7494 5.7213 6.6507 7.3909 7.0405 5.7855 6.9561 6.2795 6.7546 6.5601 7.2193 8.0782 8.7959 6.8343 7.6312 8.2041 6.0453 7.6822 7.5882 1.0923 1.0882 1.0879 1.0924 1.0927 1.0908 1.0909 1.0928 1.0989 1.0989 1.0941 1.0933 1.0911 1.0916 1.0943 1.0949 1.0989 1.0675
irintensity: 35.2950 27.9736 18.9373 2.3893 15.9914 22.1672 22.0560 8.8904 1.2470 20.9290 2.7987 0.5785 0.2591 0.6306 0.4540 0.4118 49.7929 7.7431 0.7025 0.9823 4.4614 9.4865 14.0588 14.1361 0.1612 4.3023 13.7657 18.5303 1.3438 5.9795 0.0047 0.7943 1.5957 1.0072 12.7347 169.1807 2.7319 0.1833 8.7205 0.2208 4.8842 0.6704 11.3441 0.8318 3.3224 16.5873 5.6799 0.3577 1.2320 0.2205 10.8861 22.0015 0.5431 0.0556 10.1446 0.0573 6.4833 86.1564 24.8794 12.5820 25.2010 2.9542 0.0203 0.1406 4.2668 18.8120 15.1870 8.3956 2.4589 0.5717 0.5323 2.3358 6.4741 3.0767 0.6906 1.5324 26.9983 18.7899 2.6269 11.2933 3.7237 113.2468 5.1392 7.9985 0.9508 4.6355 26.6101 61.0618 18.6395 45.9988 15.8399 98.1368 11.3453 116.6587 0.8038 3.1034 6.1031 82.7536 22.9608 25.2940 4.1092 4.6545 3.0534 2.2942 1.3893 0.2337 0.6548 74.5870 79.7093 51.2885 5.3548 95.2993 121.4454 19.4462 13.4089 45.9026 300.7375 37.7027 229.9296 134.4406 204.0873 117.2752 168.2931 135.0324 84.8638 27.5026 79.6853 43.3002 45.9189 149.7395 67.3032 1308.1343 286.3574 58.0131 255.3054 587.0581 217.7187 10.2985 154.3312 160.1792 54.6331 128.7097 221.0170 25.6738 32.9942 115.1915 295.1813 137.6453 26.6006 34.6705 2.6441 12.3102 54.6703 2.6462 125.7283 9.4719 32.7274 62.0570 4.1933 52.0803 16.2497 22.1817 4.9373 2.0083 4.1486 19.0510 4.4655 12.7834 69.8174 729.1009 545.9774 109.6345 76.5698 282.1967 86.3605 213.8335 440.4804 32.6026 334.8658 34.8520 35.4364 1.0215 0.6790 16.3237 2.0836 32.7280 30.0222 8.6172 92.1098 3.5662 18.1281 60.4938 30.9540 15.3975 0.4779 76.0738 7.3088 92.2929
temp: 298.150 k
press: 1.00000 atm
elementType: 6 6 6 6 6 6 6 6 6 6 6 7 6 6 6 6 1 1 6 6 6 6 6 6 6 6 6 6 6 6 6 6 6 6 6 6 6 6 6 6 6 6 6 6 1 6 6 6 6 6 7 1 1 1 1 1 1 1 1 1 1 1 1 1 1 8 8 1
symmnumber: 1
zpe: 1333369.4 jmol-1
zpe.correction: 0.507854 hartree
zpe.thermalcorrener: 0.539057 hartree
zpe.thermalcorrenthalpy: 0.540001 hartree
zpe.thermalcorrgfe: 0.447268 hartree
zpe.sumelectzpe: -2022.645345 hartree
zpe.sumelectthermal: -2022.614142 hartree
zpe.sumelectthermalent: -2022.613198 hartree
zpe.sumelectthermalfe: -2022.705930 hartree
dipole: 4.2745 2.7912 -17.5506
dipole: 18.2780
quadrupole: -199.0548 -177.6850 -341.0388
quadrupole: 5.0949 -44.0960 33.5188
quadrupole: 40.2047 61.5746 -101.7792 5.0949 -44.0960 33.5188
hfenergy: -2023.1531986 hartree
pointgroup: C01 [X(C46H18N2O2)]
dipole: 1.6497281 0.6935027 6.964905 debye
polarizability: 1693.160792|511.1778093|2288.4493002|41.5304917|-155.6592719|239.5083524 unknown
InChI: InChI=1S/C46H17N2.HO2/c1-2-27-25-9-7-18-3-5-20-12-22-14-23-15-47-16-28-26-10-8-19-4-6-21-13-24-17-48(11-1)46(27)45-35(24)40-33(21)31(19)37(26)41-38(29(23)28)34(22)39-32(20)30(18)36(25)42(45)44(39)43(40)41;1-2/h1-17H;1H
charge 0 multiplicity 1
68 atoms
C  -5.08961222 1.61167067 -0.24734812
C  -3.77523234 1.06972478 -0.11671266
C  -2.65829577 1.91011041 -0.11689798
C  -2.83083702 3.32026817 -0.24873834
C  -4.11393043 3.87233152 -0.38392298
C  -5.24960556 3.01906029 -0.38201674
C  -1.33880181 1.37081064 0.0065301
C  -1.69525347 4.16508439 -0.25606484
C  -0.40246547 3.63127497 -0.13242557
C  -0.22036955 2.21227018 0.00048731
C  0.72013001 4.47948557 -0.15646796
N  0.51474319 5.84585732 -0.30400639
C  -0.736358 6.37060869 -0.43269976
C  -1.86326287 5.57339464 -0.41045099
C  -3.16974621 6.11778898 -0.54327427
C  -4.27412785 5.29861194 -0.52995389
H  -3.28416748 7.19114519 -0.65674311
H  -0.78615437 7.44475839 -0.55064397
C  -3.59505824 -0.34931513 0.01325963
C  -2.30447259 -0.89467075 0.13785526
C  -1.16823905 -0.04267992 0.13530178
C  0.12104612 -0.58602991 0.25792372
C  1.25635415 0.26889477 0.2525809
C  1.09204119 1.67497631 0.11990324
C  2.05076176 3.9738689 -0.03965545
C  2.22862071 2.52253115 0.11034727
C  2.55837501 -0.28616312 0.37900561
C  3.49218167 1.94443226 0.24146351
C  -4.71736358 -1.19872944 0.01438302
C  -6.23343224 0.76544023 -0.24969449
C  -6.54839307 3.57764696 -0.5184335
C  -5.61459874 5.82631529 -0.66298412
C  3.10310977 4.86604075 -0.07734749
C  1.59289845 6.71313233 -0.33495885
C  3.65572887 0.57093681 0.37319885
C  -6.04100324 -0.68521718 -0.11128861
C  -7.64791528 2.72496579 -0.51738547
C  2.85983166 6.24253518 -0.22503786
C  -7.49327556 1.34871194 -0.38639431
C  -6.68906895 5.00928244 -0.65641151
C  -4.53518282 -2.60217597 0.14281549
C  -2.12708976 -2.31222004 0.26660263
C  0.29334628 -2.01187121 0.38832792
C  2.70805118 -1.71786852 0.50966275
H  3.71316697 -2.11736422 0.60408364
C  -3.24615107 -3.14107003 0.266696
C  -0.807529 -2.83333181 0.39011772
C  1.63549177 -2.53658984 0.51341067
C  -7.07645345 -1.59931644 -0.09588402
C  -5.69488418 -3.41862639 0.1391295
N  -6.91748925 -2.945574 0.02626974
H  3.68153537 6.94709566 -0.25358805
H  4.12843968 4.52961771 0.00347575
H  4.38094065 2.56367806 0.24443458
H  4.65491662 0.15857386 0.4721929
H  1.75464386 -3.61144415 0.60958174
H  -0.67983411 -3.90792327 0.48601898
H  -3.12334152 -4.216211 0.36203483
H  -5.58430934 -4.49610438 0.23319503
H  -8.10719475 -1.27716137 -0.18428087
H  -8.38405941 0.73175173 -0.39646581
H  -8.64475197 3.14237249 -0.62254848
H  -7.69191351 5.41342496 -0.75755868
H  -5.73100066 6.9003596 -0.76878825
H  1.34310614 7.75821932 -0.45121653
O  -0.17636209 3.96721705 -3.54642627
O  -1.42858662 3.19617688 -3.52483466
H  -1.31580072 2.61739096 -2.76063306
