program: Gaussian 09
title: combined_medium
version: ES64L-G09RevE.01
frameworkgroup: C1[X(C46H18N2O2)]
method: RwB97XD
basis: Gen
operation: Freq
keyword: #PGeom=AllCheck
keyword: Guess=TCheck
keyword: SCRF=Check
keyword: GenChk
keyword: RwB97XD/ChkBas
keyword: Freq
converged: YES YES YES YES
title: Mulliken charges:
elementType: C C C C C C C C C C C N C C C C H H C C C C C C C C C C C C C C C C C C C C C C C C C C H C C C C C N H H H H H H H H H H H H H H O O H
charge: 0.057087 -0.006769 0.033684 0.006783 0.002979 -0.041572 0.043622 0.007435 -0.023044 0.029165 0.264677 -0.471569 0.076424 0.017868 -0.220071 0.079058 0.194535 0.241344 0.013536 -0.037411 0.004137 -0.048708 -0.013490 0.005861 -0.034517 0.062198 0.024776 -0.225120 -0.054756 0.017285 0.064755 -0.168013 0.045592 0.090017 -0.199708 0.076553 -0.221027 -0.197714 -0.190094 -0.176729 0.085747 0.145459 0.112235 -0.178576 0.158092 -0.318787 -0.335451 -0.200329 -0.088387 -0.017335 -0.515795 0.193807 0.187398 0.161591 0.160789 0.153306 0.143240 0.148564 0.161440 0.157760 0.170821 0.165905 0.168607 0.172166 0.213868 -0.204875 -0.554815 0.424493
chargesum: -0.00000
title: Mulliken charges with hydrogens summed into heavy atoms:
elementType: C C C C C C C C C C C N C C C C C C C C C C C C C C C C C C C C C C C C C C C C C C C C C C C N O O
charge: 0.057087 -0.006769 0.033684 0.006783 0.002979 -0.041572 0.043622 0.007435 -0.023044 0.029165 0.264677 -0.471569 0.317768 0.017868 -0.025536 0.079058 0.013536 -0.037411 0.004137 -0.048708 -0.013490 0.005861 -0.034517 0.062198 0.024776 -0.063529 -0.054756 0.017285 0.064755 0.004154 0.232990 0.303885 -0.038919 0.076553 -0.055122 -0.003907 -0.019273 -0.008122 0.085747 0.145459 0.112235 -0.020484 -0.170223 -0.192211 -0.047023 0.069373 0.144105 -0.515795 -0.204875 -0.130322
chargesum: 0.00000
polarizability: 2.32319240e+03 -4.56918252e+02 1.79046462e+03 -7.32033105e+01 2.06827961e+01 2.38706524e+02
1716.lowfreq: -14.3171 -8.4702 0.0004 0.0005 0.0008 5.4508 28.4884 38.2399 56.1007
frequency: 28.4807 38.2151 56.0761 60.0343 67.3752 92.6803 104.9254 120.8623 141.7841 165.0856 172.8784 175.2906 197.8986 215.7683 221.6636 245.2210 249.0661 255.2140 262.9576 268.6967 279.2396 285.4856 304.6616 318.5084 340.0535 343.7509 347.1187 363.6283 370.7551 377.6601 386.1871 398.6029 409.9356 423.8638 437.8107 459.2790 461.8637 477.4304 483.8408 485.4973 513.5222 522.9615 524.5436 541.8774 554.3280 560.0638 562.1207 566.4060 575.1952 576.7868 580.6986 584.6721 590.0349 616.2188 618.3502 621.2686 627.7952 635.0619 637.0252 639.5715 640.0404 647.8647 667.5377 673.2445 690.4324 696.0614 702.0581 702.3902 725.7663 729.8083 743.0090 754.0343 757.4481 758.7920 771.5213 775.7822 782.4295 795.8082 799.7975 807.0441 808.1269 819.8315 821.0615 831.6532 842.2075 843.5761 850.5606 866.0889 868.4276 872.3518 879.8267 894.1537 894.7859 914.5195 930.8917 940.6924 942.3329 962.3088 971.3959 980.1163 989.7522 991.2744 1000.4946 1007.1655 1011.1712 1015.7936 1031.6721 1046.2324 1055.8225 1079.4663 1093.4651 1111.4902 1126.0872 1147.0814 1159.1627 1169.8845 1177.9217 1181.8781 1201.6035 1203.4774 1219.2083 1223.4432 1245.6491 1249.3000 1253.6791 1262.2406 1270.9134 1287.8503 1296.4336 1311.6098 1318.5072 1332.6865 1342.9839 1344.2096 1350.3815 1361.9613 1366.7846 1384.4846 1388.5929 1394.6224 1400.5224 1408.8562 1409.9818 1416.6093 1421.2982 1430.2278 1435.4664 1440.3887 1452.7861 1456.3773 1465.0776 1473.1390 1476.1756 1483.8275 1489.1197 1494.3526 1498.4481 1506.8614 1512.7343 1520.3563 1543.4991 1547.8381 1558.9686 1573.5666 1586.4453 1593.5869 1599.1208 1613.9292 1624.1301 1631.8194 1648.4097 1657.2888 1667.2636 1676.5635 1679.1802 1687.5864 1698.4145 1707.2937 1717.9972 1784.7644 3108.2553 3211.6263 3217.2792 3218.7925 3223.4008 3223.4982 3228.4943 3233.5491 3234.5192 3236.4513 3244.6320 3248.0689 3258.6849 3259.4104 3263.5270 3269.1395 3286.9526 3803.8526
redmass: 7.5163 5.9518 6.1929 5.7438 6.5567 5.2789 5.8013 3.6731 5.0429 2.9519 4.0537 4.0922 5.0498 5.5582 3.3541 4.2714 7.3142 4.8262 5.8455 5.7220 8.0532 6.8974 4.6525 5.3840 5.6509 7.4300 5.5408 7.0538 7.8076 6.0685 6.7950 4.8051 6.1158 6.7922 5.2541 6.0423 6.2347 5.9102 4.1667 6.6852 5.1231 4.6961 5.5241 4.8564 9.1193 5.5908 4.3259 5.1342 5.6552 5.4908 6.0741 6.5070 7.0790 6.4072 5.7615 5.3881 4.4893 7.0176 6.2545 8.7393 5.3233 4.7632 5.7306 8.0433 8.1919 7.3965 7.7161 7.1279 5.0450 4.6787 7.2113 6.7303 7.0221 4.9582 6.6863 5.2699 5.4436 3.2974 2.1830 6.4850 1.6628 6.4000 1.5103 1.5919 4.9773 5.0301 1.7770 4.2631 4.2935 1.5285 1.6940 1.7566 5.6100 1.4545 8.0004 1.5294 7.7543 1.5181 6.8792 5.6710 1.3510 1.3278 4.0113 1.6491 1.3354 1.3220 5.0118 6.3045 3.5117 3.5345 3.5537 3.8990 2.5629 3.2283 2.7057 2.4557 1.6039 1.4742 2.0364 1.8646 1.8124 1.7090 1.6769 2.3695 1.7258 1.9630 2.1356 2.0901 2.4403 2.8422 2.4634 3.6349 2.5724 2.2894 3.7625 2.5578 2.3848 2.8286 2.9137 3.0548 3.6172 1.2040 3.7052 4.3777 4.6966 5.0928 5.3960 5.1589 2.3360 4.4641 3.4766 3.2660 4.7116 3.3595 4.2930 4.6610 4.6936 5.1622 5.0235 5.0332 6.8420 5.4034 7.4080 7.3405 5.3747 7.9777 4.5330 6.0662 6.3766 5.8761 5.8802 9.1271 8.5581 7.2179 7.9530 8.0087 8.3080 7.3183 7.6480 6.6341 1.0848 1.0910 1.0872 1.0911 1.0907 1.0911 1.0878 1.0901 1.0979 1.0930 1.0988 1.0934 1.0916 1.0905 1.0925 1.0952 1.1001 1.0684
irintensity: 0.1921 4.5862 2.1499 10.8852 0.7102 7.8083 3.0805 34.3760 32.6072 129.7278 46.4196 7.5346 17.5315 59.9197 194.0297 26.7866 53.6340 20.5328 10.4082 199.0124 58.9430 52.2254 9.1840 8.2769 7.0743 48.3603 7.8708 27.7692 2.7382 16.4432 0.9864 6.4345 11.0252 5.2874 22.2221 144.0472 142.4533 11.3687 2.9676 100.2888 36.6881 73.7330 70.2096 12.0975 28.9105 33.0333 5.7401 32.3150 13.6402 4.4980 49.9829 11.4810 7.4463 8.4610 6.9804 72.7455 4.5646 44.5975 8.4236 3.5040 12.7264 39.0142 16.3497 80.6868 19.3564 214.0394 25.4910 36.4954 1.0192 13.3566 2.6020 10.9633 19.5117 0.9312 5.8774 2.3108 0.4019 4.6759 10.4579 178.9921 6.8042 18.7094 0.6841 21.0377 30.0871 33.5679 50.1552 861.3365 208.1410 78.9991 103.0950 92.2626 37.8570 23.8208 40.9758 7.4696 209.7101 122.6336 101.7743 1550.4360 1.1022 22.7033 425.5012 210.6120 1.1861 0.6445 1713.9386 620.5715 1065.9996 2060.4366 648.9431 8843.3241 10938.5117 43.6205 503.5035 448.4274 53.0011 206.4443 197.0215 90.2332 34.3006 207.5451 299.1341 1303.1735 1490.3694 100.9060 98.8001 1309.6495 325.2964 331.3046 1123.7045 520.4273 23.8223 157.1079 124.6052 206.9495 112.3289 119.0833 97.5587 52.0021 12.3662 81.7644 154.2002 41.7001 57.7035 59.7749 207.3208 131.7320 132.5684 1.1752 19.9061 246.7899 199.2263 16.3253 40.4154 195.4803 67.4517 78.5565 10.6096 66.4392 93.1614 294.6288 102.0112 280.7159 340.5655 76.3844 96.1411 788.9823 376.9530 947.4444 287.2872 112.4830 1173.8107 182.0315 858.3683 535.2471 2146.3838 611.5006 159.8010 152.4377 112.8642 54.5746 7.5461 39.7547 36.5316 35.4019 0.0970 22.8813 86.9368 10.0932 52.1199 15.4685 41.5398 1.5348 38.0237 21.1235 21.2269 182.1511
temp: 298.150 k
press: 1.00000 atm
elementType: 6 6 6 6 6 6 6 6 6 6 6 7 6 6 6 6 1 1 6 6 6 6 6 6 6 6 6 6 6 6 6 6 6 6 6 6 6 6 6 6 6 6 6 6 1 6 6 6 6 6 7 1 1 1 1 1 1 1 1 1 1 1 1 1 1 8 8 1
symmnumber: 1
zpe: 1337822.6 jmol-1
zpe.correction: 0.509550 hartree
zpe.thermalcorrener: 0.539322 hartree
zpe.thermalcorrenthalpy: 0.540266 hartree
zpe.thermalcorrgfe: 0.452644 hartree
zpe.sumelectzpe: -2022.652441 hartree
zpe.sumelectthermal: -2022.622668 hartree
zpe.sumelectthermalent: -2022.621724 hartree
zpe.sumelectthermalfe: -2022.709346 hartree
dipole: 14.9561 -17.4837 -3.0859
dipole: 23.2139
quadrupole: -268.3399 -198.4773 -289.2816
quadrupole: -18.4485 -14.5408 -0.8787
quadrupole: -16.3070 53.5556 -37.2486 -18.4485 -14.5408 -0.8787
hfenergy: -2023.1619903 hartree
pointgroup: C01 [X(C46H18N2O2)]
dipole: -5.58499 -7.1709309 0.893413 debye
polarizability: 2278.0188163|481.8004659|1837.6650366|33.6643594|8.9195521|236.6796887 unknown
InChI: InChI=1S/C46H18N2O2/c49-50-27-9-10-48-16-23-12-20-4-2-17-5-7-24-26-15-47-14-22-13-21-11-19-3-1-18-6-8-25-35(27)46(48)45-34(23)40-32(20)29(17)36(24)41-38(28(22)26)33(21)39-31(19)30(18)37(25)42(45)44(39)43(40)41/h1-16,27,49H
charge 0 multiplicity 1
68 atoms
C  2.94655618 -1.28869278 -0.05207934
C  1.98720067 -0.23302473 -0.05861142
C  0.61346936 -0.52070843 -0.06978089
C  0.17214093 -1.87888902 -0.07174213
C  1.10435562 -2.93506256 -0.06209282
C  2.49730077 -2.64235716 -0.05444664
C  -0.34578909 0.5246627 -0.07899046
C  -1.21077041 -2.16395298 -0.08065984
C  -2.1582848 -1.12925959 -0.09585322
C  -1.72911055 0.22511038 -0.09485559
C  -3.55214566 -1.41759991 -0.11295839
N  -3.91822406 -2.77786485 -0.06198931
C  -3.01077703 -3.76670011 -0.05059471
C  -1.64552405 -3.52373474 -0.07286607
C  -0.70085523 -4.57447837 -0.06267676
C  0.65279181 -4.30175171 -0.05981271
H  -1.05075582 -5.60266707 -0.05543139
H  -3.40597194 -4.77515647 -0.01135013
C  2.42032919 1.1284131 -0.05260867
C  1.47713826 2.18087861 -0.0570524
C  0.08562672 1.88330948 -0.0702738
C  -0.86588827 2.92472032 -0.07643712
C  -2.25631292 2.62288452 -0.09617785
C  -2.69491308 1.26494946 -0.10810509
C  -4.50943026 -0.42102628 -0.14824529
C  -4.0868108 0.95273122 -0.14104206
C  -3.21055567 3.66890796 -0.1085471
C  -5.00606839 2.02786529 -0.16733951
C  3.80551213 1.42300191 -0.04274032
C  4.33836265 -1.0096125 -0.04436285
C  3.43584027 -3.70769643 -0.04739198
C  1.63884629 -5.35431471 -0.05081545
C  -5.96290706 -0.75917606 -0.25919996
C  -5.28476542 -3.11875085 0.04173264
C  -4.57399237 3.33736008 -0.14212721
C  4.78469374 0.38839757 -0.03918286
C  4.79914348 -3.40251513 -0.04211966
C  -6.24177655 -2.19737303 0.00818998
C  5.23397898 -2.0861658 -0.0410481
C  2.96030929 -5.07000135 -0.04577791
C  4.22867257 2.78309467 -0.03624056
C  1.91649879 3.55368236 -0.04873217
C  -0.41933466 4.29162116 -0.06610359
C  -2.74710635 5.02851566 -0.09413565
H  -3.48949654 5.82221684 -0.10218699
C  3.28786128 3.82333991 -0.03874514
C  0.93238668 4.57828621 -0.05219478
C  -1.42513582 5.3274344 -0.07304375
C  6.11844844 0.76961894 -0.02997189
C  5.62884595 3.01854912 -0.02810841
N  6.53541802 2.06070609 -0.02507317
H  -7.27423373 -2.50688491 0.1209761
H  -6.58090638 -0.12703156 0.38703203
H  -6.07057817 1.83246968 -0.21052802
H  -5.30695626 4.13976286 -0.15615177
H  -1.09315897 6.36177285 -0.0632138
H  1.26016774 5.61444735 -0.04540405
H  3.63384121 4.85328991 -0.03346872
H  5.99237893 4.04365838 -0.02445002
H  6.9142023 0.03436702 -0.02593103
H  6.30234349 -1.90224369 -0.03913655
H  5.52513029 -4.20971917 -0.03799325
H  3.69816265 -5.86664979 -0.03912403
H  1.28920489 -6.38220133 -0.04808047
H  -5.47156686 -4.17558986 0.18239018
O  -6.51360963 -0.39248004 -1.56385044
O  -5.79994899 -1.0739653 -2.5929737
H  -6.31330546 -1.88856624 -2.71081076
