program: Gaussian 09
title: combined_medium
version: ES64L-G09RevE.01
frameworkgroup: C1[X(C46H18N2O2)]
method: UwB97XD
basis: Gen
operation: Freq
keyword: #P
keyword: Geom=AllCheck
keyword: Guess=TCheck
keyword: SCRF=Check
keyword: GenChk
keyword: UwB97XD/ChkBas
keyword: Freq
converged: YES YES NO YES
polarizability: 1.56441631e+03 -1.09962923e+00 1.37931680e+03 -2.04494271e+01 4.99349015e+01 2.36116392e+02
1716.lowfreq: -2.1837 -0.0007 0.0007 0.0008 6.5370 9.8448 28.0447 35.4680 51.8554
frequency: 28.0151 35.4501 51.8306 64.2569 74.9499 89.6228 104.6045 131.4612 140.0970 163.1189 172.1441 184.6893 202.2951 215.3995 230.1250 250.5552 253.9576 257.8659 270.7199 276.0046 285.8669 300.1620 310.6118 326.9279 332.7618 345.6281 350.2939 360.4761 374.3079 380.8522 388.6095 399.2266 402.3616 412.8388 433.6289 452.9596 470.5855 476.5561 485.8470 505.7946 514.1513 517.7974 531.1415 544.2718 553.1131 560.6463 562.3490 570.8617 574.0926 577.7374 585.4309 590.2572 600.2960 607.2583 620.4271 624.5712 628.4952 635.4229 638.3113 640.6356 646.9120 651.1047 675.1038 680.7762 697.0429 700.2842 707.3909 709.3101 718.3226 726.6138 750.1551 751.9771 759.9358 770.9573 783.5351 787.0098 788.6101 799.3398 811.9358 814.3396 819.5507 820.6862 836.2871 840.0496 845.5655 848.7007 862.7649 867.1790 868.4926 885.5775 901.1751 901.5406 915.4307 935.8206 946.0754 951.7801 963.2810 974.9415 978.4327 985.9597 995.1780 996.7219 1003.3257 1008.2404 1019.1951 1037.6958 1040.0734 1044.5293 1075.0923 1100.0237 1112.9521 1143.2140 1147.5403 1171.8634 1178.4336 1180.0540 1187.9479 1200.3044 1207.0438 1219.4750 1223.6410 1224.4742 1238.0638 1247.6994 1250.6043 1256.8102 1270.1730 1276.2325 1280.1774 1288.4796 1308.3789 1318.4982 1330.1135 1337.6114 1340.1101 1350.8807 1363.6710 1369.4434 1384.1014 1393.3769 1394.7706 1399.1080 1406.7608 1407.8126 1420.9107 1426.6534 1431.1617 1443.7551 1452.1769 1456.5727 1459.1439 1472.2806 1473.8452 1475.2643 1487.5244 1492.6492 1503.2355 1511.2367 1515.8302 1530.7576 1542.0018 1546.5068 1566.7467 1572.6110 1575.9862 1586.3026 1595.1030 1612.8890 1625.2340 1631.1818 1632.7831 1655.5794 1661.3033 1669.2924 1679.6701 1685.1842 1695.8531 1700.8631 1708.4351 1744.9995 3132.6029 3222.7113 3226.3910 3227.5663 3230.0268 3231.9983 3233.5066 3236.4407 3239.5495 3247.7818 3251.1022 3258.6250 3268.3870 3275.6293 3283.9696 3290.4588 3299.2824 3801.3623
redmass: 6.4107 6.9316 6.6316 5.9016 6.3184 5.9661 5.0105 6.2598 6.4212 4.7391 4.9787 5.1800 5.6601 6.4377 6.6778 6.1171 4.7208 6.7309 5.7215 8.0604 5.7987 5.6849 5.2913 6.5681 1.9508 1.7977 6.3010 7.3755 5.5773 7.3576 6.8015 6.5836 7.8613 5.1595 6.5072 6.0192 5.2230 5.0071 5.8657 4.0817 6.1272 5.0277 4.9583 4.8006 5.9534 7.2063 4.7942 4.9877 6.0698 4.7528 4.7204 5.9710 6.9374 7.2804 6.3862 5.3734 5.2302 5.5278 4.6134 6.7694 4.4565 7.2584 9.8651 8.2578 7.7925 6.7703 6.6307 7.6568 5.9922 4.3152 6.9087 6.2374 5.4735 4.6494 4.2138 6.4095 4.0826 6.9911 7.0939 4.6044 1.4779 1.5887 1.8812 4.6842 1.6943 4.9400 5.6676 1.6404 1.6717 1.9403 1.8000 3.9110 1.6106 7.5470 1.5477 6.7523 6.6580 3.6202 1.6439 3.1286 1.6952 1.3469 1.6848 6.1389 1.3310 1.3842 4.8819 6.6186 4.6491 3.3729 3.3313 3.3920 2.7790 1.8376 1.5429 1.7639 1.6732 2.6293 1.8148 2.4630 1.9847 2.0833 1.7208 2.1002 2.1429 1.8014 2.2289 2.8624 2.3947 2.4958 3.1668 3.8828 1.3635 3.8409 2.6330 3.3490 3.7699 2.8052 2.8030 4.0851 3.5580 4.3173 1.1978 3.9346 3.4081 5.0263 4.9986 5.3956 4.0770 4.6488 4.4909 4.0552 2.3535 4.6501 3.9959 4.5912 3.6603 3.8778 4.2200 4.3291 4.9367 7.1730 5.9648 5.2886 6.5502 5.7108 5.2801 6.5224 5.1988 7.7766 7.1336 7.8277 9.6167 8.7253 6.9061 7.4356 7.1051 8.0059 7.0580 7.4265 1.0874 1.0884 1.0915 1.0919 1.0913 1.0913 1.0890 1.0901 1.0981 1.0971 1.0946 1.0953 1.0917 1.0905 1.0941 1.0973 1.0991 1.0684
irintensity: 0.8402 1.1193 0.1145 5.2443 0.7908 1.6547 1.8228 2.7734 9.7941 0.2936 0.2577 4.5993 3.8521 6.1299 4.9102 0.8532 0.9482 1.9802 0.9921 1.8812 3.0650 2.0242 4.8852 0.7798 175.8925 96.3273 14.1288 4.3266 5.9603 0.3347 0.8856 0.0533 4.5254 1.5487 2.2628 3.9521 0.3016 2.6478 5.4645 5.7592 4.2417 7.6624 2.1278 3.3122 4.5920 2.7073 1.3948 9.4526 2.5207 9.4837 0.9036 4.2860 8.0089 5.4510 2.2655 8.3549 10.3431 11.3769 13.3438 2.0733 1.8955 14.1153 1.5126 1.5132 2.6229 4.9892 10.0015 3.7497 2.9546 2.7800 3.7128 1.7146 3.2528 3.4747 28.7999 6.4287 1.5846 5.0195 1.9357 8.1002 7.0887 2.2027 25.2162 3.4535 1.6147 34.7874 12.8820 165.7428 16.6237 36.8610 5.3463 14.0786 99.2039 3.1791 6.5942 8.6608 45.6338 6.2945 4.5788 23.4988 10.6862 1.6107 5.9032 4.5195 0.2907 0.6323 37.5315 0.4465 5.4461 4.0563 17.9813 5.7276 39.7953 14.3352 9.0115 59.2882 12.2925 3.6856 24.7804 19.6488 16.6792 29.9459 25.1397 52.8519 18.8714 12.1488 7.9111 52.1483 52.4569 37.5814 26.1801 10.1583 88.1531 13.2428 10.9004 33.3076 109.8478 7.6521 107.4253 65.0998 99.7375 12.3475 44.7927 28.5260 11.9603 3.9071 2.5338 20.2943 7.2899 21.7279 59.9886 1.4153 17.7022 56.9807 6.8658 0.1087 15.5930 83.1611 100.9584 30.7515 111.8792 5.0176 16.1842 6.9721 48.1420 21.3773 2.6212 0.8119 24.1303 8.6693 2.5563 8.6020 19.5004 24.6076 39.9129 14.7128 10.5496 19.3030 103.8008 67.2363 24.2313 2.3309 19.5310 21.4280 13.4134 10.6268 4.2626 6.1860 44.6694 30.7130 1.0872 15.6760 40.4713 4.4741 2.5751 8.7757 18.6184 120.9048
temp: 298.150 k
press: 1.00000 atm
elementType: 6 6 6 6 6 6 6 6 6 6 6 7 6 6 6 6 1 1 6 6 6 6 6 6 6 6 6 6 6 6 6 6 6 6 6 6 6 6 6 6 6 6 6 6 1 6 6 6 6 6 7 1 1 1 1 1 1 1 1 1 1 1 1 1 1 8 8 1
symmnumber: 1
zpe: 1341489.2 jmol-1
zpe.correction: 0.510946 hartree
zpe.thermalcorrener: 0.540472 hartree
zpe.thermalcorrenthalpy: 0.541416 hartree
zpe.thermalcorrgfe: 0.453607 hartree
zpe.sumelectzpe: -2022.524319 hartree
zpe.sumelectthermal: -2022.494794 hartree
zpe.sumelectthermalent: -2022.493850 hartree
zpe.sumelectthermalfe: -2022.581658 hartree
dipole: 22.2595 -1.4155 -3.0549
dipole: 22.5127
quadrupole: -143.5965 -191.6508 -282.5717
quadrupole: -6.6163 -7.2839 17.6563
quadrupole: 62.3432 14.2889 -76.6320 -6.6163 -7.2839 17.6563
hfenergy: -2023.0352655 hartree
pointgroup: C01 [X(C46H18N2O2)]
dipole: -6.7953275 5.4739404 1.5196208 debye
polarizability: 1480.3240767|-89.2885829|1461.3612757|-40.0399056|65.879964|238.164149 unknown
InChI: InChI=1S/C46H18N2O2/c49-50-46-25-10-7-18-6-9-23-26-15-47-14-21-13-20-12-19-4-3-17-5-8-22-24-2-1-11-48-16-27(46)36-39-35(25)30(18)34(23)40-37(28(21)26)32(20)38-31(19)29(17)33(22)41(42(38)43(39)40)44(36)45(24)48/h1-16,46,49H
charge 1 multiplicity 2
68 atoms
C  4.48492584 -1.9065776 -0.52196214
C  4.72339748 -0.49565088 -0.51653897
C  3.62756464 0.42125114 -0.47807352
C  2.30472881 -0.05908677 -0.49588027
C  2.04395691 -1.48527956 -0.53289556
C  3.13682343 -2.39024092 -0.50625388
C  3.87552331 1.81964085 -0.40466353
C  1.2397564 0.84756964 -0.40936647
C  1.48019644 2.22782548 -0.27734994
C  2.80395072 2.72751146 -0.29760937
C  0.39949409 3.13406426 -0.10856729
N  -0.88216688 2.62937315 -0.03605339
C  -1.12051578 1.25754975 -0.18877544
C  -0.11739929 0.38640317 -0.40410226
C  -0.4224146 -1.04341295 -0.75937874
C  0.73845994 -1.97746732 -0.56074065
H  -1.31994688 -1.39926288 -0.24736224
H  -2.16093305 0.96735939 -0.13767123
C  6.04003871 -0.00259399 -0.52977597
C  6.29544621 1.40051482 -0.49512487
C  5.22148949 2.30678366 -0.42079326
C  5.46871784 3.69894886 -0.35549886
C  4.3822899 4.61533509 -0.24720029
C  3.04390448 4.1377936 -0.20266815
C  0.60806831 4.53011068 0.00585098
C  1.9734446 5.04419321 -0.0688886
C  4.63959615 6.00395779 -0.1737307
C  2.25766292 6.42296203 0.0002339
C  7.12875212 -0.9128896 -0.5731568
C  5.55974043 -2.81886676 -0.53760332
C  2.88485473 -3.78416678 -0.48756461
C  0.5028022 -3.35880243 -0.52563443
C  -0.50500727 5.34594544 0.19751259
C  -1.95307602 3.44756927 0.15573488
C  3.55238523 6.88801409 -0.05435101
C  6.91181141 -2.30895703 -0.5823673
C  3.99489377 -4.68156873 -0.47791954
C  -1.78255677 4.80028879 0.27501369
C  5.27432254 -4.21788246 -0.5070321
C  1.55477099 -4.248982 -0.48099722
C  8.4653962 -0.41688027 -0.6086557
C  7.641063 1.88916875 -0.5216506
C  6.80721081 4.18334827 -0.38813507
C  5.99588968 6.47089341 -0.21966092
H  6.1743428 7.54054637 -0.16630867
C  8.7078041 0.96738943 -0.58622053
C  7.86404922 3.27736652 -0.47461484
C  7.03220291 5.60148586 -0.3221192
C  8.05190889 -3.13505778 -0.63916161
C  9.5100736 -1.36252098 -0.66084148
N  9.31147058 -2.67963398 -0.67853726
H  -2.65079673 5.42739628 0.42897762
H  -0.39689273 6.41875009 0.2948538
H  1.45711571 7.14605477 0.09658181
H  3.74508665 7.95502654 -0.00051842
H  8.0559754 5.96138764 -0.35367843
H  8.88455047 3.64867722 -0.49878238
H  9.73002945 1.33258848 -0.61249001
H  10.54020632 -1.0187724 -0.69038721
H  7.95366234 -4.21397801 -0.66048773
H  6.08675179 -4.93430065 -0.50097357
H  3.79829065 -5.74886494 -0.45264587
H  1.36837597 -5.31791489 -0.45387569
H  -0.52084919 -3.7202037 -0.54107485
H  -2.91936254 2.96361807 0.20160609
O  -0.66801434 -1.14168827 -2.19126677
O  -1.91965952 -0.53338072 -2.49690701
H  -1.65955934 0.33382065 -2.84574791
