program: Gaussian 09
title: 000032749
version: EM64L-G09RevD.01
frameworkgroup: C1[X(C6H10Cl2)]
method: RPBEPBE
basis: SDD
operation: Freq
keyword: #pfreq=noraman
keyword: PBEPBE/SDD
title: #p freq=noraman PBEPBE/SDD
converged: YES YES NO NO
title: Mulliken charges:
elementType: Cl Cl C C C C C C H H H H H H H H H H
charge: -0.069035 -0.069035 -0.315280 -0.394207 -0.394206 -0.352777 -0.352777 -0.407025 0.248490 0.241110 0.268268 0.268268 0.230643 0.220122 0.220121 0.230643 0.219838 0.206839
chargesum: 0.00000
title: Mulliken charges with hydrogens summed into heavy atoms:
elementType: Cl Cl C C C C C C
charge: -0.069035 -0.069035 0.174319 -0.125939 -0.125938 0.097987 0.097987 0.019653
polarizability: 1.02147759e+02 -3.92238717e-05 8.02084060e+01 -1.39491952e-05 2.60237464e+00 5.90963196e+01
1716.lowfreq: -24.8923 -0.0028 0.0012 0.0026 9.1880 19.3054 114.7885 131.6297 165.7176
frequency: 114.7861 131.5839 165.7175 255.8703 285.2038 306.1111 324.2424 417.9666 429.7215 479.1127 657.2369 734.8968 821.8843 854.6416 865.6140 903.5713 929.7613 951.4857 1039.7789 1068.3080 1098.6241 1114.3709 1145.5060 1164.7881 1215.0708 1221.1027 1255.1285 1262.3407 1290.2955 1316.1017 1325.2423 1329.4497 1341.7024 1348.6202 1461.9100 1464.7729 1467.9399 1479.0732 2980.4739 3001.8096 3002.6796 3018.6210 3046.5254 3048.9801 3051.0498 3073.5204 3077.0851 3096.9730
redmass: 4.5584 2.8273 7.4003 1.9007 4.0472 8.0133 6.7136 2.7091 2.3228 1.8273 6.9509 2.2548 2.8879 1.5162 1.8788 2.1080 2.0641 2.0800 1.7616 1.0631 3.0172 2.2633 2.6349 1.1124 1.2856 1.2688 1.2671 1.2700 1.2679 1.4268 1.3298 1.3400 1.4081 1.4562 1.0850 1.0919 1.0826 1.0930 1.0643 1.0626 1.0616 1.0623 1.0876 1.0901 1.0935 1.1014 1.1024 1.1029
irintensity: 2.1207 0.2290 2.8206 0.8440 0.1462 7.4873 13.3511 6.1421 0.0384 0.8877 70.0508 9.3738 18.1065 0.2114 1.9648 11.8323 0.6517 24.0751 10.5848 0.6396 0.2132 0.1984 3.3546 0.1343 9.7783 16.5861 2.4102 1.4314 12.0564 7.6963 23.1778 7.4256 4.3895 1.0805 6.9661 8.2803 18.3821 13.4818 32.8163 12.1687 14.2608 3.9711 2.8206 8.2481 40.4492 17.6351 42.6688 37.4200
temp: 298.150 k
press: 1.00000 atm
elementType: 17 17 6 6 6 6 6 6 1 1 1 1 1 1 1 1 1 1
symmnumber: 1
zpe: 391401.7 jmol-1
zpe.correction: 0.149077 hartree
zpe.thermalcorrener: 0.157307 hartree
zpe.thermalcorrenthalpy: 0.158251 hartree
zpe.thermalcorrgfe: 0.115361 hartree
zpe.sumelectzpe: -1154.129972 hartree
zpe.sumelectthermal: -1154.121742 hartree
zpe.sumelectthermalent: -1154.120798 hartree
zpe.sumelectthermalfe: -1154.163688 hartree
dipole: 0.0000 2.9303 0.9171
dipole: 3.0705
quadrupole: -76.3361 -61.8793 -60.5221
quadrupole: 0.0000 0.0000 -0.2801
quadrupole: -10.0903 4.3666 5.7237 0.0000 0.0000 -0.2801
hfenergy: -1154.2790488 hartree
pointgroup: C01 [X(C6H10Cl2)]
dipole: -0.0000171 -1.1396405 -0.4006742 debye
dipolederiv: -0.6690867 0.2149816 0.0348474 0.2472859 -0.380462 -0.0211857 0.1107132 -0.0551404 -0.1976163 -0.6690987 -0.214981 -0.0348316 -0.2472842 -0.3804577 -0.0211769 -0.110698 -0.055132 -0.1976119 -0.282415 0.0000003 0.0000052 0.0000003 -0.1068425 -0.0685268 0.0000051 -0.0412184 0.033981 0.7788606 -0.2731406 -0.074611 -0.2261095 0.4637308 0.0534811 -0.0288759 0.0532253 0.270337 0.7788711 0.2731396 0.0745941 0.2261091 0.4637259 0.0534713 0.0288594 0.0532153 0.2703326 -0.1039004 0.1023114 0.0402869 0.0405833 -0.0541937 0.0369539 0.03401 -0.0356328 0.0784628 -0.1039058 -0.102314 -0.0402809 -0.0405831 -0.0541922 0.0369558 -0.0340047 -0.0356292 0.0784654 0.1624894 0.0000019 0.0000004 -0.0000014 -0.0158072 -0.0196663 0.0000013 0.1331288 0.1770649 0.0691106 0.0000006 0.0000002 0.0000006 -0.0874162 0.0691218 0.0000003 0.0719229 0.0555902 0.0611168 -0.0000002 -0.0000025 0.0000006 0.0946842 0.0092823 -0.0000026 -0.0236533 -0.0870047 -0.0099514 0.0285413 0.0343022 0.0207553 0.0103587 -0.0333276 -0.0038368 -0.013262 -0.1242245 -0.0099527 -0.0285415 -0.0343063 -0.0207566 0.0103594 -0.0333253 0.0038326 -0.0132609 -0.1242227 -0.1004161 -0.1055996 -0.039899 -0.0810672 0.0042172 -0.0211771 -0.0567315 -0.0283199 0.0713222 0.0857749 0.0133096 -0.0161454 0.0317464 0.0516686 -0.0413628 0.0175078 0.004206 -0.127462 0.0857745 -0.0133095 0.0161389 -0.0317479 0.0516689 -0.0413624 -0.0175141 0.0042064 -0.1274625 -0.1004101 0.1055999 0.0399041 0.0810677 0.0042146 -0.0211801 0.0567365 -0.0283236 0.0713196 0.003471 0.0000013 0.000001 0.0000004 -0.1675067 0.0656306 0.0000014 0.0938592 0.0535588 0.0236681 -0.000001 -0.0000035 0.0000004 0.0922501 -0.0026059 -0.000004 -0.0841914 -0.1748301 unknown
polarizability: 102.1477587|-0.0000283|80.0021728|-0.0007028|3.3292393|59.3025528 unknown
InChI: InChI=1S/C6H10Cl2/c7-5-2-1-3-6(8)4-5/h5-6H,1-4H2
charge 0 multiplicity 1
18 atoms
Cl -2.795737 1.258091 0.188744
Cl 2.795788 1.258058 0.188648
C  0.000022 1.081064 0.03428
C  -1.252509 0.283547 -0.373671
C  1.252528 0.283531 -0.373715
C  -1.283691 -1.120726 0.243025
C  1.283713 -1.120741 0.24298
C  -0.000001 -1.89492 -0.160931
H  0.000018 2.075951 -0.441837
H  0.000042 1.229115 1.12967
H  -1.365271 0.242662 -1.470864
H  1.365253 0.242649 -1.470911
H  -2.187927 -1.662091 -0.087066
H  -1.334902 -1.027374 1.344695
H  1.334958 -1.027388 1.344649
H  2.187932 -1.662118 -0.087137
H  0.000004 -2.888632 0.32346
H  -0.000021 -2.074879 -1.255319
