program: Gaussian 09
title: combined_medium
version: ES64L-G09RevE.01
frameworkgroup: C1[X(C46H18N2O)]
method: UwB97XD
basis: Gen
operation: Freq
keyword: #P
keyword: Geom=AllCheck
keyword: Guess=TCheck
keyword: SCRF=Check
keyword: GenChk
keyword: UwB97XD/ChkBas
keyword: Freq
converged: YES YES YES YES
polarizability: 1.54789643e+03 -1.99952665e+01 1.33297626e+03 -1.67380031e+01 2.07180800e+01 2.21033285e+02
1716.lowfreq: -14.9238 -0.0005 -0.0003 0.0004 6.0011 12.7875 29.8217 41.9967 59.3866
frequency: 29.8010 41.9910 59.3580 63.4725 76.1183 104.2412 133.4403 134.3819 156.3448 169.4890 184.2715 202.9871 228.1481 238.1879 253.6101 256.7544 268.6633 276.4116 283.0470 286.4356 302.2589 313.8143 337.6955 348.0366 358.2019 359.3032 371.5718 383.7029 388.9854 399.5651 410.2888 418.9528 435.7102 455.1265 468.8175 474.5099 479.8162 493.5617 510.8584 520.0595 531.7859 538.3756 553.3567 556.5830 563.4342 574.0161 576.3965 577.5495 585.2167 587.5796 593.5401 611.5805 618.2868 625.1443 632.6143 635.3943 643.7703 645.4862 651.2021 655.0935 667.8118 682.4553 700.8497 701.9871 706.9527 713.7851 720.9379 732.3965 749.0568 751.0001 756.3560 762.9067 781.6339 785.4965 789.0221 789.9560 812.2177 816.1417 817.0643 826.5424 835.2040 840.8879 847.5605 852.1474 864.9074 866.1712 868.3411 898.2764 898.6318 911.5223 927.5471 935.4561 942.2237 952.3526 966.9598 986.2758 987.1109 998.3798 1002.6058 1014.7445 1018.7642 1037.9508 1040.1472 1042.9732 1073.6792 1095.4442 1117.9873 1146.1006 1151.2661 1169.2965 1172.6165 1180.9313 1183.2213 1194.9677 1202.5547 1209.2182 1212.6455 1221.9803 1226.8818 1230.4942 1250.8397 1255.2855 1259.8068 1272.9202 1276.5051 1284.6599 1304.0759 1306.8276 1321.5602 1331.0460 1337.7025 1341.3422 1354.8544 1363.8260 1370.1304 1383.9448 1387.1104 1403.4730 1407.6416 1416.3141 1421.1779 1432.9166 1436.4734 1447.8252 1450.0932 1452.5038 1459.7917 1466.7273 1475.5975 1476.0919 1482.1743 1486.7542 1494.7004 1502.0428 1510.3419 1517.1798 1529.9369 1539.1307 1553.6243 1557.4685 1570.9291 1575.1381 1583.9792 1594.7714 1602.6475 1625.0445 1637.4514 1642.8943 1651.0159 1663.9728 1673.4259 1676.5258 1689.3322 1694.2727 1697.1600 1703.8896 1705.9456 3191.6513 3224.5259 3225.1655 3225.3405 3225.7412 3227.6471 3232.0736 3232.9037 3236.4228 3242.6476 3245.9949 3253.4993 3259.4486 3268.8460 3278.4234 3286.3104 3292.7668 3841.4524
redmass: 6.7554 6.0945 6.5981 5.5790 5.7210 5.2874 6.0022 5.7121 4.8793 4.6289 5.0182 5.5157 6.3659 5.2586 5.3882 6.4251 5.6370 5.5483 7.3512 5.9789 5.4266 4.2885 5.2762 6.4148 5.6302 4.3734 6.8743 3.0767 2.2493 6.6143 5.2344 5.7177 4.9259 5.7957 5.7741 4.5515 5.8377 5.9823 4.2217 4.8343 5.2335 4.9425 4.9770 6.2537 4.9567 5.3774 5.4271 7.0700 4.5791 4.8458 8.5616 5.8627 5.9194 5.5561 5.7295 4.0824 6.9608 4.5712 7.5342 6.4514 9.9625 8.3022 7.2306 6.6423 6.9052 5.9724 6.1838 4.7487 7.1188 6.1926 5.8362 4.8014 5.9393 4.6328 3.9333 5.6285 7.4222 4.8848 1.4754 1.5225 1.5423 5.2466 3.5058 2.5005 3.5712 1.8564 1.7833 1.6355 5.9009 1.6847 6.5036 1.6876 5.0035 1.5350 7.0390 1.9873 2.9445 1.3185 1.3201 1.3454 1.3436 1.4530 5.2772 4.9811 5.2962 3.8748 3.2428 3.6382 2.4777 1.9195 2.2681 2.1583 1.4652 1.7983 2.0283 2.0360 1.8109 2.8137 1.9074 2.0075 2.0974 2.0329 1.7643 2.0900 2.3247 2.2305 2.4197 2.6840 3.6736 2.8806 2.7330 3.6406 3.1882 3.1402 3.2825 4.9328 4.1940 3.8474 3.5609 4.3125 3.4336 4.0946 1.6403 5.4275 6.0935 3.7126 2.6338 2.8676 4.4005 3.5815 4.8683 3.4670 5.7483 4.2114 3.7187 5.0084 4.5779 3.5097 6.1475 4.8362 5.2537 6.7950 4.7263 6.2162 5.4675 6.2933 5.2002 6.9431 7.6141 7.8516 8.9455 7.3910 7.7812 6.4123 7.3880 8.1238 7.9069 1.0898 1.0892 1.0905 1.0912 1.0904 1.0918 1.0916 1.0929 1.0912 1.0974 1.0968 1.0930 1.0945 1.0911 1.0904 1.0935 1.1003 1.0669
irintensity: 0.2146 0.4878 2.1037 4.5459 0.7150 0.5624 3.6093 0.9619 0.6557 0.2524 0.9883 0.4614 2.2079 4.7156 2.7339 4.6657 2.5877 5.2393 0.0438 5.4514 1.1882 1.0225 9.2881 6.4159 8.5216 8.9078 5.1724 72.6309 136.3958 1.9644 1.7306 34.9456 8.8208 1.4591 2.1798 2.8903 10.6297 2.1319 0.3965 9.9320 2.9700 0.7271 3.9787 1.4375 2.1247 5.9836 17.3190 7.1400 0.0100 1.1714 2.3603 10.8101 3.5371 5.0496 5.3913 24.4986 6.8618 2.4787 8.9659 10.7322 2.7527 4.6114 2.5517 9.0631 1.5487 9.5900 6.2389 7.9260 7.5606 8.3542 0.1139 13.6781 6.9364 11.9164 8.5588 24.0456 4.2996 5.5481 1.1866 0.2015 32.3800 11.4562 7.9707 31.3324 2.3626 34.8889 62.0512 55.0401 38.2072 71.8677 24.0767 48.4714 14.1214 1.0090 9.0072 3.0279 1.7621 0.9795 1.3416 0.4702 1.2679 0.3904 4.1046 24.8307 5.8659 72.4043 5.7087 14.2386 52.9994 11.5053 98.7048 11.4003 35.9178 21.5109 133.2442 17.9797 49.7674 38.5010 252.9473 158.4224 51.5353 57.0365 28.3052 58.8779 6.7192 32.0121 118.0262 53.2462 49.0744 31.4762 27.1502 27.1351 1.1649 42.3133 86.8770 7.8963 307.0107 109.2618 0.7018 3.8543 197.0617 4.1227 95.1024 22.0973 5.3833 26.8188 12.4104 5.8139 21.7999 55.1078 1.9206 1.1357 9.8653 145.0690 54.1243 12.4399 10.7990 51.7682 102.4054 115.4658 15.6382 2.8219 12.3343 38.7756 9.7085 118.9643 8.1513 54.3477 9.9274 1.9156 7.9910 232.5704 18.7529 6.7409 194.6579 58.0207 29.4096 8.4125 9.8874 18.1236 8.3812 1.3745 25.0245 19.7860 10.2881 7.8512 41.4574 34.2656 1.1217 12.4794 31.3627 6.3364 10.9735 2.5324 111.9720
temp: 298.150 k
press: 1.00000 atm
elementType: 6 6 6 6 6 6 6 6 6 6 6 7 6 6 6 6 1 1 6 6 6 6 6 6 6 6 6 6 6 6 6 6 6 6 6 6 6 6 6 6 6 6 6 6 1 6 6 6 6 6 7 1 1 1 1 1 1 1 1 1 1 1 1 1 1 8 1
symmnumber: 1
zpe: 1335792.5 jmol-1
zpe.correction: 0.508777 hartree
zpe.thermalcorrener: 0.536978 hartree
zpe.thermalcorrenthalpy: 0.537922 hartree
zpe.thermalcorrgfe: 0.453147 hartree
zpe.sumelectzpe: -1947.438840 hartree
zpe.sumelectthermal: -1947.410639 hartree
zpe.sumelectthermalent: -1947.409695 hartree
zpe.sumelectthermalfe: -1947.494470 hartree
dipole: 20.2556 -4.6470 -1.0785
dipole: 20.8097
quadrupole: -153.8174 -170.2889 -275.8264
quadrupole: -4.3886 -10.0348 6.5153
quadrupole: 46.1602 29.6887 -75.8488 -4.3886 -10.0348 6.5153
hfenergy: -1947.9476169 hartree
pointgroup: C01 [X(C46H18N2O1)]
dipole: 8.0708231 -1.2438328 -0.5870256 debye
polarizability: 1548.6216604|-3.3868621|1330.1348102|-41.2304871|39.8558338|223.1494972 unknown
InChI: InChI=1S/C46H18N2O/c49-46-26-14-20-6-4-18-8-10-24-27-16-47-15-22-13-21-12-19-5-3-17-7-9-23-25-2-1-11-48(46)45(25)44-36(26)39-32(20)30(18)35(24)40-37(28(22)27)33(21)38-31(19)29(17)34(23)41(44)42(38)43(39)40/h1-16,46,49H
charge 1 multiplicity 2
67 atoms
C  -2.87210654 -1.44967703 0.05170969
C  -2.10185334 -0.23960673 0.10396146
C  -0.68328547 -0.28673657 0.08758574
C  -0.0174625 -1.54697204 0.03633921
C  -0.7692065 -2.7507404 -0.01824254
C  -2.19537885 -2.70228575 -0.01766395
C  0.07058022 0.90477396 0.12284286
C  1.3845273 -1.59875878 0.05227079
C  2.1421778 -0.39066767 0.05237096
C  1.49873956 0.85164521 0.08043366
C  3.56405359 -0.43258595 -0.06574076
N  4.20172667 -1.64834501 -0.12939717
C  3.51479407 -2.9178717 0.26238566
C  2.03508983 -2.85425193 0.03963522
C  1.31347538 -4.01817958 -0.03913159
C  -0.10217302 -3.99430677 -0.07581413
H  1.82678212 -4.97568762 -0.05127013
H  3.97057807 -3.70655014 -0.33441102
C  -2.75192768 1.00705605 0.17466754
C  -2.0021385 2.21064459 0.21974576
C  -0.59436436 2.16183898 0.1848917
C  0.15977571 3.36757991 0.20781624
C  1.58123155 3.3205516 0.13622363
C  2.25947822 2.06931636 0.056121
C  4.32885984 0.74913287 -0.17194514
C  3.66181846 2.03552344 -0.05929476
C  2.32069452 4.52465629 0.134427
C  4.3787706 3.25700763 -0.06280579
C  -4.17584988 1.05696009 0.19854166
C  -4.28128977 -1.41182714 0.06597745
C  -2.92997067 -3.90547892 -0.07757553
C  -0.87125919 -5.1952098 -0.14350067
C  5.70778783 0.62415654 -0.40291817
C  5.52144111 -1.746151 -0.35340814
C  3.72775042 4.45967979 0.03836131
C  -4.94875335 -0.12254849 0.1453697
C  -4.34378843 -3.8392502 -0.06602916
C  6.30056358 -0.61921617 -0.51660992
C  -4.99484764 -2.63526801 0.00545768
C  -2.23274127 -5.15062492 -0.1449431
C  -4.83423289 2.31630305 0.27799055
C  -2.67535648 3.47907455 0.2961726
C  -0.50775012 4.618126 0.28345601
C  1.62968887 5.77404481 0.22531836
H  2.21559448 6.68819178 0.23066845
C  -4.08271045 3.50792306 0.32759643
C  -1.90823212 4.65488035 0.33202826
C  0.27304606 5.8200484 0.29854551
C  -6.34491626 0.02500602 0.17352916
C  -6.24248884 2.314396 0.30077975
N  -6.97750859 1.20565925 0.25005534
H  7.35944751 -0.72714434 -0.70951632
H  6.33053487 1.5034828 -0.50833258
H  5.45926668 3.26085055 -0.13520333
H  4.29735796 5.38395039 0.04195774
H  -0.24635498 6.77108746 0.36438101
H  -2.41393597 5.61433114 0.39114451
H  -4.59845634 4.46157782 0.38798057
H  -6.77777265 3.25777221 0.36275945
H  -6.99459811 -0.84152176 0.13457068
H  -6.07833606 -2.63053928 0.01511372
H  -4.91256697 -4.76299121 -0.1113765
H  -2.8143497 -6.06634039 -0.19234018
H  -0.3476881 -6.1450027 -0.18957724
H  5.93359522 -2.74723136 -0.38102332
O  3.84230747 -3.19866844 1.60021672
H  3.29037941 -2.66395161 2.18793136
