program: Gaussian 09
title: b3lyp-Ru-9-OOH-LS-freq
version: ES64L-G09RevE.01
frameworkgroup: C1[X(C37H36N7O2Ru)]
method: UB3LYP
basis: Gen
operation: Freq
keyword: #p
keyword: freq
keyword: ub3lyp/gen
keyword: scrf=(solvent=h2o,smd)
keyword: pseudo=read
title: #p freq ub3lyp/gen scrf=(solvent=h2o,smd) pseudo=read
basis: NPDir=0 NMtPBC= 1 NCelOv= 1 NCel= 1 NClECP= 1 NCelD= 1
basis: NCelK= 1 NCelE2= 1 NClLst= 1 CellRange= 0.0.
basis: One-electron integrals computed using PRISM.
basis: 1 Symmetry operations used in ECPInt.
basis: ECPInt: NShTT= 48205 NPrTT= 255490 LenC2= 34145 LenP2D= 98083.
basis: LDataN: DoStor=T MaxTD1= 6 Len= 172
basis: NBasis= 889 RedAO= T EigKep= 1.27D-04 NBF= 889
basis: NBsUse= 889 1.00D-06 EigRej= -1.00D+00 NBFU= 889
converged: NO YES NO NO
polarizability: 9.20482931e+02 -2.29665177e+01 9.10430322e+02 -1.14370960e+02 6.53704890e+01 6.57431579e+02
1716.lowfreq: -10.1940 -7.2385 -0.0002 0.0007 0.0007 10.8616 15.3337 22.3495 28.0617
frequency: 13.6405 22.1682 27.9223 30.8266 36.0208 41.4608 44.6092 46.5799 48.6422 50.8122 52.9409 57.6022 67.2634 82.5076 95.8632 103.1606 106.8888 116.3256 123.6637 127.4140 143.1298 153.9744 162.6466 168.4941 179.3467 183.1263 197.9060 203.8251 206.6040 207.7839 224.1358 225.0326 229.5207 236.9043 258.7383 265.0477 272.6735 286.3865 288.6986 292.8738 299.7605 334.0825 337.4687 346.9600 354.6855 359.3715 365.0932 374.5812 401.5668 408.0062 409.3285 415.0144 418.1630 423.3431 430.4148 486.7714 492.9114 504.5925 507.2265 510.5172 517.7462 521.0378 539.4426 547.1859 548.2347 550.7900 554.1859 559.2053 565.7361 584.5573 602.0597 615.4915 619.4899 639.2155 642.2413 660.7373 680.3386 681.4322 714.9719 732.3938 732.8040 737.1117 769.0461 777.5802 780.3443 798.6212 802.7262 804.9385 809.9308 820.5381 824.0034 825.0889 830.2381 832.0704 834.4914 838.1229 861.9615 869.5353 873.9716 879.1719 882.0179 893.5643 906.5007 930.5951 935.1866 941.1945 942.5815 953.6050 973.3535 974.5418 985.5410 986.0142 989.6289 992.2406 994.5424 1000.9744 1004.2272 1009.0216 1010.0105 1016.3470 1018.4864 1024.1845 1024.9210 1043.2889 1045.4687 1052.5490 1054.7130 1059.0799 1063.0566 1063.3787 1071.8579 1079.9684 1084.8753 1089.1112 1126.9495 1138.5885 1144.6495 1150.3502 1153.8109 1167.0985 1176.8830 1191.0974 1212.8590 1226.4254 1229.8468 1234.7803 1238.2125 1247.9586 1254.9456 1256.7371 1263.1017 1263.9949 1272.7699 1285.8373 1308.3762 1309.8955 1318.9310 1324.7553 1332.2146 1347.6668 1358.8341 1366.0458 1367.3940 1376.1562 1386.3939 1404.5921 1408.3372 1409.2980 1412.8762 1414.2429 1415.2719 1435.5644 1442.8799 1453.3762 1454.2474 1458.0245 1464.6068 1469.3517 1476.2373 1476.8924 1480.6991 1482.8209 1484.2646 1488.1979 1489.5064 1495.2870 1501.5546 1505.5195 1507.7426 1514.5217 1538.7871 1544.3967 1547.4381 1556.5759 1559.9409 1588.2099 1600.1291 1603.6000 1603.9057 1605.7979 1642.6128 1644.1240 1651.1632 1658.3644 1660.1756 1667.1818 1668.2727 2870.6873 3046.8736 3047.6638 3053.3430 3053.6436 3054.6214 3117.3371 3118.2996 3119.5252 3121.0715 3122.2196 3126.6105 3127.3419 3129.9320 3150.2801 3151.2253 3194.3771 3209.0843 3217.1793 3218.6316 3219.0795 3219.7576 3219.8258 3221.3361 3222.6635 3225.2590 3238.6402 3243.3178 3245.0576 3253.3516 3253.5987 3255.6990 3255.9299 3256.3699 3259.6675 3275.0274
redmass: 4.8474 4.8481 5.0829 4.7493 4.6432 4.2346 1.0378 3.9837 1.7894 1.4711 3.3293 4.0895 6.0860 5.6340 5.4129 4.3965 4.8396 5.4068 5.3103 5.7712 6.4508 6.2260 5.0100 5.3067 6.4878 6.7449 5.3696 4.1715 4.9414 5.0015 3.5759 4.2466 1.9047 3.5250 2.0303 2.9334 5.4037 1.7355 4.9923 4.5909 4.4835 3.3370 5.0441 1.1227 3.2948 3.1336 2.8661 4.3586 2.7257 2.7442 2.7810 4.0186 4.1980 4.2184 4.2256 3.8476 4.2394 3.2132 2.9469 3.4401 3.7452 3.8120 3.6385 7.1474 7.1225 5.7263 6.5800 5.8380 3.8316 8.0688 4.6600 5.3031 6.9993 4.1914 7.5143 7.9559 6.9375 6.9362 4.0104 3.3186 3.2795 3.1359 2.6034 5.3958 6.1227 1.8999 1.5655 1.7526 3.1347 6.7666 2.1977 1.9964 4.3913 4.4656 1.9748 2.1299 3.6471 1.6435 1.5673 1.2521 1.2485 2.1921 1.9359 1.4817 4.4607 2.8961 2.2718 1.7685 4.9707 1.2031 3.4577 1.3954 1.2999 1.3900 1.4007 1.4119 1.3973 1.3770 1.3623 1.4356 1.4574 1.3850 1.3886 6.4761 6.3163 1.9603 1.3978 2.9085 1.6737 1.6547 2.4447 2.3356 2.2009 2.1889 3.1181 1.3629 1.3803 1.3469 1.3615 1.4355 1.3616 1.5692 2.5321 2.6828 1.3025 1.4244 2.4417 2.9146 2.7891 2.3419 2.1228 2.0753 2.0292 2.3044 7.1174 6.9608 2.4539 2.3235 2.8318 5.9496 1.3191 1.8856 1.8158 3.1187 3.8906 7.4303 1.2062 7.5696 1.2962 1.2482 1.2422 1.2347 2.2401 2.0125 1.8151 1.7142 2.7780 2.3173 1.1253 1.2581 1.1212 1.2226 1.0462 1.0788 1.1691 2.1488 1.7984 1.5224 1.1006 1.0865 2.2592 2.1652 1.3513 2.9214 3.1960 6.4703 5.6011 5.9340 6.1494 5.6478 6.3974 6.5661 5.6628 6.0138 5.9241 5.7027 5.5982 1.0776 1.0353 1.0348 1.0407 1.0364 1.0390 1.0985 1.0961 1.1035 1.1035 1.1035 1.1027 1.1025 1.1026 1.1042 1.1048 1.0911 1.0919 1.0911 1.0915 1.0913 1.0920 1.0920 1.0918 1.0926 1.0921 1.0974 1.0943 1.0972 1.0926 1.0927 1.0935 1.0941 1.0949 1.0941 1.0905
irintensity: 2.2606 0.3267 5.2204 2.0220 1.3696 0.5995 0.6971 2.5712 0.2245 0.4335 0.4835 0.4815 4.8141 1.9107 2.1115 0.3322 0.2183 3.7711 0.5766 3.8205 5.5168 3.7287 0.3067 0.2913 2.2059 2.1399 0.1854 6.5587 8.4879 1.6188 1.3351 3.4081 0.5658 8.4503 11.8920 29.0306 10.2350 1.5828 2.7796 0.9398 0.6555 6.4596 4.3553 0.1339 4.9692 5.2899 0.5462 6.9499 5.3344 0.0650 0.1037 2.8705 16.8517 0.8753 3.0652 9.4763 2.8714 15.8234 22.9899 14.4805 1.3867 3.4482 13.7641 8.3514 2.7520 12.8652 18.8545 15.4296 7.7972 12.2809 0.2004 2.9623 0.0503 5.4558 5.7926 17.4373 0.1147 0.1726 16.5673 5.9185 9.4991 3.5577 4.3286 6.4157 2.5685 326.0782 10.7325 35.8092 56.3067 67.5820 36.2309 29.7318 12.5710 75.2071 35.4763 20.6221 13.9754 74.2070 71.9610 0.1521 0.1707 268.8526 21.2161 2.4823 36.4556 3.9931 14.2797 9.3305 1.3502 0.4621 4.4867 0.9734 2.2233 0.3587 0.5697 0.4806 0.2990 1.1202 0.5776 1.2404 8.0744 2.5609 2.4443 38.8676 2.5934 21.2679 0.4635 9.5176 21.7896 20.0954 3.2340 1.2784 68.2953 3.1151 0.6647 4.2925 3.8019 19.2508 21.5177 52.2609 7.2023 6.4976 0.1756 5.9378 46.8953 25.5395 16.5336 29.2520 45.8721 0.6519 24.1851 0.6255 8.3899 52.5636 4.3096 6.4401 35.2218 12.0650 9.2425 15.8045 5.9501 6.4860 1.0369 36.3939 19.3937 26.8936 2.8386 28.4526 6.8380 1.7657 1.8139 1.5938 19.6584 17.0662 4.3007 7.0809 21.2797 15.5298 23.6676 37.5798 22.8200 38.8005 0.1736 1.4734 3.6438 16.5163 106.4984 7.6495 7.0476 7.8684 27.4376 22.3733 24.9303 86.1851 229.5084 56.5704 84.9234 15.7618 46.1808 1.7849 345.0525 170.9077 49.4637 67.2076 112.6903 103.7936 168.0571 2429.2091 36.0773 41.6551 10.1311 22.6694 9.9120 12.5727 15.7250 16.8202 29.9827 39.8164 51.3041 72.4951 80.2281 19.0522 17.3373 23.5938 9.7371 2.2286 2.5181 2.6300 2.0397 1.8405 1.9082 1.8207 0.8374 7.6290 0.1783 2.2126 3.9549 0.7106 9.7336 6.2833 0.6328 3.2971 2.8978
temp: 298.150 k
press: 1.00000 atm
elementType: 44 6 6 6 1 1 1 6 6 6 6 6 1 1 6 6 6 6 6 1 1 6 6 6 6 6 1 1 6 6 6 1 1 1 7 7 7 7 7 8 6 6 6 6 6 1 1 1 1 6 6 6 6 6 1 1 1 1 7 7 8 1 6 6 1 1 1 6 1 1 1 6 1 1 1 6 1 1 1 6 1 1 1
symmnumber: 1
zpe: 1754760.9 jmol-1
zpe.correction: 0.668353 hartree
zpe.thermalcorrener: 0.710730 hartree
zpe.thermalcorrenthalpy: 0.711675 hartree
zpe.thermalcorrgfe: 0.590430 hartree
zpe.sumelectzpe: -2058.406664 hartree
zpe.sumelectthermal: -2058.364287 hartree
zpe.sumelectthermalent: -2058.363343 hartree
zpe.sumelectthermalfe: -2058.484587 hartree
dipole: 3.6563 -8.6004 -5.3113
dipole: 10.7492
quadrupole: -153.0442 -162.9575 -208.1741
quadrupole: 45.2026 6.9162 -15.4223
quadrupole: 21.6811 11.7678 -33.4488 45.2026 6.9162 -15.4223
hfenergy: -2059.0750172 hartree
pointgroup: C01 [X(C37H36N7O2Ru1)]
dipole: -1.4384984 -3.3836735 2.0896201 debye
polarizability: 920.482923|22.9665194|910.4303301|-114.370949|-65.3705084|657.431579 unknown
InChI: InChI=1S/C25H21N5.2C6H7N.H2O2.Ru/c1-25(2,3)18-14-21(19-10-8-16-6-4-12-26-23(16)29-19)28-22(15-18)20-11-9-17-7-5-13-27-24(17)30-20;2*1-6-2-4-7-5-3-6;1-2;/h4-15H,1-3H3;2*2-5H,1H3;1-2H;/q-3;2*-1;;+6/p-1
charge 2 multiplicity 2
83 atoms
Ru 0.515543 0.521294 -0.338576
C  4.631557 -1.044209 -2.024599
C  5.332497 -2.242373 -1.770728
C  4.704265 -3.226149 -1.044902
H  5.09009 -0.258319 -2.618906
H  6.336051 -2.370189 -2.159113
H  5.186415 -4.175795 -0.834792
C  2.776413 -1.744322 -0.839563
C  3.39032 -3.001574 -0.564418
C  2.655379 -3.964511 0.162382
C  1.373813 -3.672603 0.559388
C  0.827395 -2.402845 0.268954
H  3.107731 -4.924667 0.388978
H  0.788469 -4.39951 1.107372
C  -0.554199 -2.046457 0.654348
C  -1.521849 -2.943215 1.095986
C  -2.828206 -2.499601 1.369516
C  -3.093269 -1.135077 1.20241
C  -2.081786 -0.268238 0.777716
H  -1.268885 -3.989641 1.206438
H  -4.079076 -0.742024 1.404116
C  -1.096502 3.238609 0.321271
C  -2.206273 1.198075 0.649687
C  -3.418242 1.85648 0.952391
C  -3.472319 3.226484 0.910112
C  -2.300019 3.953274 0.610701
H  -4.294349 1.280014 1.217543
H  -4.393554 3.758713 1.125283
C  0.076926 5.199817 0.104232
C  -2.25586 5.36969 0.605288
C  -1.063772 5.999607 0.346651
H  1.035824 5.678843 -0.079674
H  -3.164323 5.925597 0.815972
H  -0.977986 7.080205 0.334785
N  3.405917 -0.798445 -1.580651
N  1.520246 -1.448074 -0.384548
N  0.074625 3.875494 0.086155
N  -1.085076 1.862377 0.290274
N  -0.851841 -0.738935 0.502403
O  1.641332 1.838531 -1.228923
C  -0.568786 -0.986843 -2.821786
C  -1.192619 -1.163841 -4.04779
C  -1.769462 -0.070988 -4.709814
C  -1.677095 1.170456 -4.068928
C  -1.040502 1.275759 -2.839657
H  -0.114995 -1.828218 -2.314295
H  -1.224182 -2.157458 -4.482878
H  -2.100619 2.061704 -4.520046
H  -0.959338 2.234172 -2.343481
C  2.86551 1.109823 1.493828
C  3.604664 1.299886 2.652627
C  2.985318 1.209617 3.906182
C  1.612224 0.930382 3.910632
C  0.932237 0.751832 2.714064
H  3.326569 1.181818 0.517071
H  4.663984 1.520357 2.571175
H  1.06402 0.851614 4.843752
H  -0.128047 0.534121 2.71548
N  -0.48986 0.215442 -2.211194
N  1.542095 0.839771 1.512748
O  2.253103 1.426259 -2.461697
H  2.663553 0.541549 -2.188175
C  -3.894498 -3.502341 1.826885
C  -3.418413 -4.184064 3.130453
H  -4.171215 -4.907773 3.459513
H  -2.475819 -4.722137 2.992801
H  -3.279212 -3.449899 3.930995
C  -5.250667 -2.826941 2.090715
H  -5.183214 -2.068258 2.877532
H  -5.655515 -2.355661 1.188983
H  -5.969656 -3.583127 2.419663
C  -4.080308 -4.569767 0.721552
H  -3.155794 -5.119929 0.523038
H  -4.839826 -5.292447 1.037101
H  -4.414592 -4.111088 -0.21492
C  -2.433298 -0.226476 -6.047977
H  -1.677318 -0.358167 -6.831302
H  -3.074818 -1.112677 -6.066888
H  -3.032248 0.651493 -6.300256
C  3.757346 1.380317 5.183063
H  3.146454 1.858926 5.953324
H  4.063826 0.400899 5.570517
H  4.661978 1.972254 5.024069
