program: Gaussian 09
title: tpssh-Co-27-VAC-HS
version: ES64L-G09RevE.01
frameworkgroup: C1[X(C29H25CoN5O2)]
method: UTPSSh
basis: Gen
operation: FOpt
keyword: #p
keyword: opt
keyword: utpssh/gen
keyword: scrf=(smd,solvent=h2o)
keyword: pseudo=read
title: #p opt utpssh/gen scrf=(smd,solvent=h2o) pseudo=read
basis: NPDir=0 NMtPBC= 1 NCelOv= 1 NCel= 1 NClECP= 1 NCelD= 1
basis: NCelK= 1 NCelE2= 1 NClLst= 1 CellRange= 0.0.
basis: One-electron integrals computed using PRISM.
basis: 1 Symmetry operations used in ECPInt.
basis: ECPInt: NShTT= 27730 NPrTT= 150069 LenC2= 22259 LenP2D= 67344.
basis: LDataN: DoStor=T MaxTD1= 6 Len= 172
basis: NBasis= 686 RedAO= T EigKep= 5.61D-04 NBF= 686
basis: NBsUse= 686 1.00D-06 EigRej= -1.00D+00 NBFU= 686
converged: YES YES YES YES
dipole: -0.0001 0.0003 -3.8830
dipole: 3.8830
quadrupole: -118.8329 -145.4645 -146.2369
quadrupole: 10.0845 -0.0002 -0.0011
quadrupole: 18.0119 -8.6198 -9.3921 10.0845 -0.0002 -0.0011
hfenergy: -1689.3108622 hartree
pointgroup: C01 [X(C29H25Co1N5O2)]
dipole: -0.000095 0.0004111 -1.5276808 debye
InChI: InChI=1S/C29H25N5O2.Co/c1-35-28(22-12-3-7-18-30-22,23-13-4-8-19-31-23)26-16-11-17-27(34-26)29(36-2,24-14-5-9-20-32-24)25-15-6-10-21-33-25;/h3-21H,1-2H3;/q-3;+3
charge 2 multiplicity 4
62 atoms
O  -3.59707483 0.00357301 1.77975374
O  3.59716333 -0.00455425 1.7795655
N  0.00002472 -0.00025861 1.0331799
N  -1.65963996 -1.30571352 -1.04537368
N  -1.64828421 1.52462958 -0.8484032
N  1.65965052 1.30615966 -1.0448352
N  1.648214 -1.52434471 -0.84920331
C  -1.17523353 -0.00106789 1.69625859
C  -1.20349564 0.06615149 3.09011935
C  0.00009292 -0.00070844 3.78631255
C  1.20364615 -0.06734926 3.09003474
C  1.17531905 0.00032692 1.6961979
C  -2.49688296 0.02051232 0.88636779
C  -2.67983491 -1.06815793 -0.19730421
C  -3.92881957 -1.66738103 -0.38644852
C  -4.10223433 -2.5732413 -1.43217975
C  -3.03351621 -2.84061267 -2.2864186
C  -1.83710753 -2.16892388 -2.06838155
C  -2.56914999 1.3593424 0.12489026
C  -3.54763175 2.31245236 0.40367197
C  -3.58570765 3.47537676 -0.36790928
C  -2.65448658 3.6420218 -1.39168386
C  -1.7028871 2.64627722 -1.59362418
C  2.49692656 -0.02103972 0.88622723
C  2.67991446 1.06806153 -0.19700276
C  3.9289778 1.66715162 -0.38604673
C  4.10241417 2.5734377 -1.43140517
C  3.03362874 2.84137193 -2.28538325
C  1.83713381 2.16979101 -2.06748573
C  2.56905972 -1.35956428 0.12419684
C  3.54741241 -2.31290861 0.40263035
C  3.5853814 -3.47552113 -0.36942571
C  2.65418769 -3.64163285 -1.39331204
C  1.70271421 -2.64569328 -1.59488332
H  -2.13647717 0.15581206 3.62533441
H  0.00012137 -0.00088872 4.87105534
H  2.13665026 -0.1572032 3.62517654
H  -4.76161562 -1.41356549 0.2530773
H  -5.06611023 -3.04784964 -1.5827427
H  -3.12424079 -3.52847397 -3.11891461
H  -0.99647696 -2.29518585 -2.73929843
H  -0.96537542 2.73886289 -2.38070094
H  -2.65593834 4.52164206 -2.0249189
H  -4.33786126 4.2326631 -0.17317003
H  -4.26046965 2.14173732 1.1992647
H  4.76181295 1.41290723 0.25325882
H  5.06635363 3.04794258 -1.58188835
H  3.12436206 3.52958494 -3.11758756
H  0.99643718 2.29649521 -2.73823601
H  4.26023264 -2.14261112 1.19832846
H  4.33743107 -4.23298091 -0.17495982
H  2.6555645 -4.52099261 -2.02690881
H  0.96522318 -2.73786765 -2.38202832
Co -0.00003986 0.00026066 -1.03282553
C  3.82773454 1.19929609 2.56221297
H  3.87284047 0.90741267 3.61318752
H  4.79028497 1.62586579 2.27340045
H  3.03842858 1.94083666 2.41953934
C  -3.82742087 -1.20057631 2.56200785
H  -3.87234528 -0.90910093 3.613103
H  -4.79000221 -1.62708826 2.27321162
H  -3.03810069 -1.94201856 2.41890505
