program: Gaussian 09
title: 000032721
version: EM64L-G09RevD.01
frameworkgroup: C1[X(C10H18O2)]
method: RPBEPBE
basis: SDD
operation: Freq
keyword: #pfreq=noraman
keyword: PBEPBE/SDD
title: #p freq=noraman PBEPBE/SDD
converged: YES YES NO NO
title: Mulliken charges:
elementType: O O C C C C C C C C C C H H H H H H H H H H H H H H H H H H
charge: -0.301325 -0.301307 -0.023547 -0.023749 -0.420678 -0.420621 -0.387829 -0.388026 -0.376575 -0.376708 -0.372344 -0.372269 0.230206 0.230246 0.206216 0.215463 0.206423 0.215291 0.206285 0.197114 0.197074 0.206406 0.196111 0.200739 0.196236 0.200772 0.216982 0.213232 0.216957 0.213224
chargesum: 0.00000
title: Mulliken charges with hydrogens summed into heavy atoms:
elementType: O O C C C C C C C C C C
charge: -0.301325 -0.301307 0.206659 0.206498 0.001002 0.001093 0.015571 0.015453 0.020274 0.020299 0.057871 0.057912
polarizability: 1.41862316e+02 3.19451823e+00 9.44867724e+01 -8.57920725e-02 1.35530837e-01 9.85966872e+01
1716.lowfreq: -4.7302 0.0004 0.0006 0.0008 7.5254 18.0962 26.2211 32.0238 45.9514
frequency: 26.1907 31.8556 45.5155 62.1225 93.9996 95.2595 126.4939 145.7455 149.3615 198.7304 217.0139 329.0858 347.1660 402.8494 411.8689 467.0928 487.7057 722.0363 732.4340 735.2172 740.6563 769.6880 785.9942 799.3956 853.1608 893.5374 916.7587 948.1223 986.8253 997.6305 1005.9748 1012.0675 1031.5720 1039.7120 1066.9621 1078.2982 1080.3358 1098.6608 1100.8594 1119.5915 1122.3733 1163.7467 1179.3254 1211.5229 1217.4234 1234.3103 1241.5758 1250.3524 1272.2319 1281.5146 1290.8846 1299.8603 1306.8225 1336.2667 1355.2220 1358.0285 1396.2121 1396.9297 1461.7337 1461.9198 1465.0950 1468.6242 1478.1813 1481.2723 1483.2425 1488.5066 2954.9906 2956.4045 2961.9368 2967.8590 2983.7421 2984.3958 2990.2806 3000.5245 3015.5388 3032.2091 3045.5597 3050.3555 3057.7213 3058.7047 3075.4718 3075.6904 3162.9266 3163.8171
redmass: 4.1360 2.9139 4.4204 4.0646 2.5810 2.0649 3.9692 1.9138 2.2473 5.5233 3.8162 3.5118 3.0872 2.1537 3.1999 2.7666 3.6177 1.0778 2.1192 5.9258 1.8898 1.8121 3.4335 1.8529 1.1991 1.3790 1.6086 1.9147 1.7684 2.2902 1.5212 1.4202 1.6300 1.9821 2.5864 2.5666 2.3934 1.2948 1.3587 1.2928 1.3244 2.0806 1.7750 1.2857 1.4418 1.4943 1.4299 1.2838 1.2940 1.1407 1.0918 1.1005 1.3074 1.4150 1.5217 1.6725 1.9905 1.9858 1.0906 1.0970 1.0759 1.1195 1.1570 1.1836 1.1374 1.1016 1.0590 1.0589 1.0596 1.0591 1.0605 1.0606 1.0962 1.0993 1.1023 1.1030 1.1007 1.1004 1.0537 1.0536 1.0928 1.0929 1.1186 1.1186
irintensity: 0.5220 8.5887 3.3354 0.2757 0.4154 0.4109 2.0858 0.6640 0.2121 0.5881 10.7666 0.0865 3.0391 0.0686 16.7402 8.0906 0.2311 10.2010 2.0516 6.8371 8.1001 2.1130 80.1091 2.8707 2.5083 0.0679 7.6576 4.0305 3.1900 4.9289 0.0240 0.3640 3.5970 1.9066 0.8489 0.0474 0.2247 7.1899 0.6686 8.6641 6.0610 5.6758 1.7286 25.6165 2.4185 0.2208 0.9608 0.0139 0.5756 0.2137 0.2407 0.0829 0.5965 1.1885 0.9909 0.0429 25.4302 3.5267 1.8120 0.2675 0.0222 5.1691 1.4455 2.9725 3.9836 28.4892 0.0594 0.0569 0.5273 90.5357 21.0746 70.5294 2.3198 0.5799 0.2639 14.7670 2.5856 106.1576 44.0569 52.5263 31.9134 57.6124 38.6688 36.5481
temp: 298.150 k
press: 1.00000 atm
elementType: 8 8 6 6 6 6 6 6 6 6 6 6 1 1 1 1 1 1 1 1 1 1 1 1 1 1 1 1 1 1
symmnumber: 1
zpe: 684233.2 jmol-1
zpe.correction: 0.260611 hartree
zpe.thermalcorrener: 0.274772 hartree
zpe.thermalcorrenthalpy: 0.275716 hartree
zpe.thermalcorrgfe: 0.216882 hartree
zpe.sumelectzpe: -541.230647 hartree
zpe.sumelectthermal: -541.216485 hartree
zpe.sumelectthermalent: -541.215541 hartree
zpe.sumelectthermalfe: -541.274375 hartree
dipole: -0.0011 0.0177 0.7299
dipole: 0.7301
quadrupole: -115.8052 -74.8614 -69.0975
quadrupole: 20.6628 -0.5514 0.1498
quadrupole: -29.2172 11.7267 17.4905 20.6628 -0.5514 0.1498
hfenergy: -541.4912572 hartree
pointgroup: C01 [X(C10H18O2)]
dipole: -0.0005287 0.1466619 0.2469834 debye
polarizability: 141.8000063|3.1213969|95.6348278|-1.8486411|1.7983336|97.510942 unknown
InChI: InChI=1S/C10H18O2/c1(3-5-9-7-11-9)2-4-6-10-8-12-10/h9-10H,1-8H2
charge 0 multiplicity 1
30 atoms
O  -5.763915 0.409395 -0.248723
O  5.765234 -0.410566 0.244554
C  -4.487828 -0.405875 -0.174552
C  4.487918 0.038667 -0.437375
C  -3.20256 0.313886 -0.533975
C  3.203621 -0.618711 0.028685
C  -1.946394 -0.461936 -0.066819
C  1.946831 0.161442 -0.429496
C  -0.629313 0.238547 -0.468933
C  0.630011 -0.532427 -0.015243
C  -5.249577 -0.094209 1.078313
C  5.250052 0.996642 0.427904
H  -4.606369 -1.41361 -0.600467
H  4.60488 0.139301 -1.526978
H  -3.215566 1.324462 -0.081722
H  -3.164128 0.458025 -1.632217
H  3.219205 -0.699676 1.132832
H  3.163752 -1.653939 -0.365266
H  -1.977793 -0.585439 1.035103
H  -1.961508 -1.48528 -0.496331
H  1.965432 0.279792 -1.532952
H  1.974318 1.185922 -0.005239
H  -0.605236 0.36568 -1.571332
H  -0.610959 1.261078 -0.037862
H  0.607437 -1.556934 -0.441688
H  0.610567 -0.654535 1.087687
H  -5.867934 -0.867426 1.551354
H  -4.870677 0.688717 1.748663
H  5.867303 1.779046 -0.031297
H  4.872898 1.217761 1.43537
