program: Gaussian 09
title: tpssh-Ru-13-O-LSb. Has opt coords. Trying Ru(IV)
version: ES64L-G09RevE.01
frameworkgroup: C1[X(C27H19N5O5Ru)]
method: UTPSSh
basis: Gen
operation: Freq
keyword: #P
keyword: Geom=AllCheck
keyword: Guess=TCheck
keyword: SCRF=Check
keyword: GenChk
keyword: UTPSSh/ChkBas
keyword: Freq
converged: YES YES YES YES
polarizability: 6.52030720e+02 -7.53444511e+00 5.44140334e+02 3.10361384e+01 -4.20496786e+01 6.41678751e+02
1716.lowfreq: -27.7056 0.0004 0.0008 0.0009 3.0567 8.4844 19.0295 21.3651 28.3889
frequency: 17.3140 20.9661 28.1740 34.8204 40.5716 48.7915 52.9897 56.3062 59.8697 63.5827 68.0285 82.3563 87.0626 114.2577 143.3702 151.9690 158.2243 172.7752 177.2706 180.8561 189.2212 193.4232 215.2964 218.6504 222.4204 244.6008 261.6400 273.6835 282.7356 286.1153 315.5496 324.5334 346.7142 357.6368 392.7912 395.0490 401.7826 408.3498 429.2211 435.8778 448.7854 454.8801 457.5035 494.5678 504.6875 536.0268 566.3050 595.3365 630.4350 641.3462 646.7719 647.7458 650.4213 653.8594 657.4876 675.6559 689.8570 696.9092 704.3393 737.5576 740.3268 750.7727 759.7071 767.8764 773.3932 774.1953 782.7428 788.3792 798.9605 823.9183 846.5528 856.6890 860.4561 881.5434 892.3456 919.6292 936.9449 950.5730 958.3109 965.8622 976.2430 996.9337 1004.1885 1007.4911 1011.3394 1023.1640 1025.9585 1028.8271 1028.8994 1032.5519 1034.2126 1039.2001 1048.0029 1050.0615 1052.3594 1090.4018 1093.7071 1096.3565 1102.6151 1104.2070 1109.2668 1109.9744 1125.8805 1151.8825 1172.3636 1172.5966 1174.4726 1183.5171 1189.3034 1201.2540 1207.7572 1232.3695 1239.1934 1298.8922 1300.2063 1309.4216 1323.5160 1327.3156 1329.5605 1357.6574 1369.1182 1378.5937 1383.4474 1392.0938 1410.1463 1439.0472 1449.5578 1473.2785 1482.3597 1486.3588 1505.1614 1516.4026 1520.6283 1525.2615 1534.1491 1603.3344 1611.5612 1614.1287 1617.9499 1620.2714 1622.5603 1625.0492 1638.5252 1643.7484 1655.2510 1655.6715 3214.6810 3221.7860 3223.4732 3230.4528 3231.6988 3233.7698 3235.1265 3236.4090 3239.9531 3241.3766 3241.9013 3242.5550 3247.0244 3249.0219 3252.6271 3253.0198 3254.7589 3265.1773 3266.6409
redmass: 9.3133 6.7733 6.0085 5.7958 4.3244 5.6583 13.8625 5.8390 5.9153 5.5588 5.8191 8.7207 6.2216 6.1290 5.7070 7.0255 6.7854 5.2884 5.4408 5.5392 6.9790 6.5455 7.2977 6.7683 9.7179 7.8989 5.9771 9.2495 7.8466 13.0125 6.3204 10.6870 8.2215 6.6776 6.8402 3.0452 2.7926 7.5577 4.3254 3.9085 4.0359 4.1460 4.1311 8.0977 7.3587 5.9155 7.3042 5.9112 7.4889 6.8203 6.6778 7.5408 6.3719 6.4968 6.2533 8.3273 8.1488 1.7798 1.9552 8.6030 4.3442 2.3020 3.0300 1.7170 1.8202 1.9049 2.6755 6.8195 12.8071 2.1367 2.5414 3.3433 4.9901 1.2542 1.2439 5.5717 1.4410 1.3955 1.3778 1.3112 1.3037 1.4169 7.1285 1.3978 7.5918 1.3426 1.3133 1.3351 1.3195 1.3138 6.6765 6.4591 6.5897 6.8788 6.8392 1.7077 1.7259 3.3598 1.6166 1.7343 1.7222 1.8324 1.7233 2.0499 1.0744 1.0752 1.2522 1.6774 2.5105 1.2152 1.9109 1.2076 1.2278 3.7271 6.3474 4.9299 7.9817 3.8059 8.2396 3.6510 5.1303 7.1577 1.2340 1.2192 3.4197 4.6543 2.7306 2.4842 2.2824 2.2701 3.2172 3.0746 1.9420 1.9232 10.1057 6.6744 7.3972 8.2442 8.0030 5.3469 5.3893 5.7181 6.1278 6.0968 5.2477 5.2009 1.0891 1.0887 1.0886 1.0892 1.0901 1.0942 1.0910 1.0910 1.0962 1.0962 1.0932 1.0949 1.0969 1.0954 1.0965 1.0962 1.0958 1.0940 1.0941
irintensity: 20.9589 6.8499 6.1970 6.9210 2.7722 2.6019 1.6125 4.7867 0.3295 4.4232 2.2581 13.7973 12.1234 2.5240 2.7513 13.0906 2.2815 8.4002 5.9781 4.9544 0.2860 0.7566 1.3352 3.9766 4.6164 25.7395 4.7596 0.6045 22.2263 51.9839 5.3889 34.7551 5.2609 7.4057 14.8170 2.7904 0.4884 14.2804 15.5186 5.7515 8.0601 6.9167 17.2876 3.5970 0.5167 5.1443 1.9703 16.0534 3.9346 10.4010 1.7087 14.8338 1.6591 4.4429 12.4178 84.6818 31.4542 74.5322 83.1673 30.5363 22.2254 1.4591 14.2800 22.7324 107.1842 93.7871 49.7364 90.5753 163.4331 61.5744 6.7932 38.4408 17.2139 0.3751 0.2936 12.1295 2.1627 0.0057 0.3170 1.5945 2.9524 0.0948 21.3075 0.4834 6.3381 0.9798 0.7993 0.2369 0.0351 0.0443 24.7813 1.6621 4.5807 10.3921 3.0971 54.6896 12.2252 5.6299 16.4225 4.5952 24.4945 15.5475 7.8051 17.9695 1.8429 3.0174 0.0834 89.3251 19.0640 33.2064 51.1904 22.8244 16.4435 89.7316 68.9289 345.8861 3.2242 20.8258 22.7296 118.3749 392.0242 207.1242 4.6715 2.8382 14.4527 99.0066 21.7427 44.6362 13.2964 106.5411 226.4259 53.7241 8.4790 8.2565 1179.1378 55.7076 396.7820 732.0370 487.8592 1.4232 6.5838 13.0559 67.0319 7.4126 2.6654 61.7163 7.4549 3.1775 3.3184 2.4968 3.2848 5.0057 2.2105 1.9336 1.7663 1.8540 0.0781 4.4350 1.1431 0.0005 0.6637 3.6203 3.5226 11.3696 7.4297
temp: 298.150 k
press: 1.00000 atm
elementType: 44 6 6 6 6 6 1 1 1 6 6 6 6 6 1 1 1 6 6 6 6 6 1 1 1 7 7 7 6 8 8 6 8 8 7 6 6 6 1 6 1 6 1 1 1 7 6 6 6 1 6 1 6 1 1 1 8
symmnumber: 1
zpe: 1098128.4 jmol-1
zpe.correction: 0.418255 hartree
zpe.thermalcorrener: 0.450451 hartree
zpe.thermalcorrenthalpy: 0.451395 hartree
zpe.thermalcorrgfe: 0.350647 hartree
zpe.sumelectzpe: -1783.921946 hartree
zpe.sumelectthermal: -1783.889750 hartree
zpe.sumelectthermalent: -1783.888806 hartree
zpe.sumelectthermalfe: -1783.989553 hartree
dipole: 33.3319 6.4269 19.4138
dipole: 39.1052
quadrupole: -396.6609 -154.2023 -191.3995
quadrupole: -17.0903 17.5033 -7.1457
quadrupole: -149.2400 93.2186 56.0214 -17.0903 17.5033 -7.1457
hfenergy: -1784.3402006 hartree
pointgroup: C01 [X(C27H19N5O5Ru1)]
dipole: 13.5875532 1.860963 6.9726979 debye
polarizability: 655.161454|-13.8992926|549.6059153|28.6214609|-47.1138667|633.0824351 unknown
InChI: InChI=1S/C17H9N3O4.2C5H5N.O.Ru/c21-16(22)14-8-2-6-12(19-14)10-4-1-5-11(18-10)13-7-3-9-15(20-13)17(23)24;2*1-2-4-6-5-3-1;;/h1-9H;2*1-5H;;/q-3;2*-1;;+5
charge 0 multiplicity 3
57 atoms
Ru 0.49656008 0.06464742 -0.62504901
C  -2.33463596 0.91640067 1.12131117
C  -4.42094474 0.68787495 0.16459539
C  -2.21211866 2.24234914 0.68825079
C  -4.37939846 2.00270669 -0.31664298
C  -3.26368654 2.79319523 -0.04166331
H  -1.32470609 2.81832826 0.92681213
H  -5.21410401 2.39286153 -0.88610962
H  -3.21406107 3.8201074 -0.389026
C  0.93568632 -0.43370103 2.29771436
C  -1.27380686 0.30997554 1.98027437
C  0.70228812 -0.64404392 3.65547285
C  -1.5586218 0.07917227 3.332219
C  -0.56554315 -0.39962129 4.17866012
H  1.50015753 -1.01257907 4.28795252
H  -2.55290488 0.30163571 3.70074443
H  -0.76911848 -0.57231088 5.22943179
C  3.29511825 -0.84883319 -0.44433954
C  2.2338127 -0.73815298 1.66327142
C  4.49129613 -1.2703289 0.12632828
C  3.40889562 -1.1573449 2.30012242
C  4.53627764 -1.4181161 1.51861044
H  5.35379629 -1.47465478 -0.49660092
H  3.44948249 -1.27631712 3.37579871
H  5.45388199 -1.74083522 1.9978874
N  -3.41627986 0.15483367 0.8898112
N  -0.05297813 0.03526587 1.46064206
N  2.22391074 -0.59354429 0.32549292
C  3.03586151 -0.64026935 -1.91570206
O  3.93026367 -0.84446141 -2.7544321
O  1.8287944 -0.24697812 -2.22840786
C  -5.63720904 -0.19500146 -0.11146445
O  -5.64391063 -1.37207689 0.36351592
O  -6.56799625 0.32420159 -0.80757057
N  1.24328293 2.05144793 -0.52718897
C  1.59322371 2.68521834 0.61336001
C  1.37551302 2.70373108 -1.70492252
C  2.08956127 3.98453629 0.61298601
H  1.47052882 2.13708318 1.53859235
C  1.86012304 4.00493704 -1.77760337
H  1.07985378 2.15515363 -2.59052899
C  2.22635407 4.66012175 -0.60039579
H  2.35740696 4.44917741 1.55488897
H  1.9445981 4.48604405 -2.74521334
H  2.60864864 5.6749272 -0.62792296
N  -0.10715001 -1.96962303 -0.85468338
C  -0.26145334 -2.85946377 0.14982971
C  -0.32386899 -2.37899967 -2.12644256
C  -0.63057827 -4.18031323 -0.08287086
H  -0.0878577 -2.50549805 1.15742021
C  -0.69753999 -3.68279635 -2.43047081
H  -0.19118886 -1.63018446 -2.89726954
C  -0.8527747 -4.60441326 -1.39328321
H  -0.74114014 -4.85418153 0.75873089
H  -0.86096686 -3.95974508 -3.46554168
H  -1.14164959 -5.62906171 -1.60173069
O  -0.92593873 0.60903223 -1.56138879
