program: Gaussian 09
title: tpssh-Ru-12-OH-LS-freq.
version: ES64L-G09RevE.01
frameworkgroup: C1[X(C23H18N7ORu)]
method: UTPSSh
basis: Gen
operation: Freq
keyword: #p
keyword: freq
keyword: utpssh/gen
keyword: pseudo=read
keyword: scrf=(SMD,
keyword: solvent=h2o)
title: #p freq utpssh/gen pseudo=read scrf=(SMD, solvent=h2o)
basis: NPDir=0 NMtPBC= 1 NCelOv= 1 NCel= 1 NClECP= 1 NCelD= 1
basis: NCelK= 1 NCelE2= 1 NClLst= 1 CellRange= 0.0.
basis: One-electron integrals computed using PRISM.
basis: 1 Symmetry operations used in ECPInt.
basis: ECPInt: NShTT= 19110 NPrTT= 105278 LenC2= 15777 LenP2D= 49806.
basis: LDataN: DoStor=T MaxTD1= 6 Len= 172
basis: NBasis= 585 RedAO= T EigKep= 1.96D-04 NBF= 585
basis: NBsUse= 585 1.00D-06 EigRej= -1.00D+00 NBFU= 585
converged: YES YES NO NO
polarizability: 6.60285594e+02 1.22622131e-03 5.72641995e+02 -3.86108852e+01 -5.10567473e-03 4.34601756e+02
1716.lowfreq: -17.5635 -5.5983 -0.0007 0.0003 0.0004 5.4139 23.3654 33.5673 34.7292
frequency: 22.7624 33.4281 34.6556 49.0576 72.5197 78.1298 102.9720 103.9141 125.6863 128.6229 162.8354 165.9847 174.9344 182.6913 229.5708 230.5796 237.2677 238.5758 255.6580 266.9785 297.4190 311.3062 314.1577 330.0760 354.7437 365.1215 373.7217 419.8570 421.1587 430.3576 439.6011 454.2973 458.0797 459.7693 472.4201 500.3905 522.9312 547.0042 553.8778 562.7077 627.5783 642.0846 647.4154 651.1079 651.9306 666.3166 675.4034 692.5724 729.8888 738.2406 755.1678 758.4568 764.3886 779.5026 794.3380 799.1220 828.9497 833.6364 834.6588 838.9831 850.2704 910.2709 911.9727 936.5064 962.9112 988.7143 988.8022 1008.2815 1012.7095 1018.4443 1025.1602 1027.5659 1028.1058 1029.2157 1029.6694 1030.4501 1035.4494 1037.2819 1049.5899 1059.9464 1074.5121 1076.9396 1089.4475 1098.2011 1112.5802 1125.2669 1128.1757 1137.6888 1139.9008 1154.5157 1162.9259 1179.9399 1182.0537 1213.9859 1255.8813 1273.0099 1308.6935 1309.4679 1313.3079 1318.3002 1326.7768 1328.6923 1334.6265 1361.2189 1361.8808 1365.9266 1426.5747 1439.8224 1446.5952 1473.8558 1483.2222 1485.5151 1490.8895 1501.0919 1509.6710 1531.8393 1595.1301 1600.0562 1602.4758 1609.9462 1613.2995 1621.8978 1635.6007 1639.3836 1645.2845 1648.2570 3229.4052 3229.4229 3231.8615 3233.5172 3233.6472 3238.5645 3238.8786 3242.9197 3243.8604 3244.8931 3247.5653 3248.5227 3250.7611 3250.9234 3252.7092 3258.6912 3262.9112 3719.3228
redmass: 5.8989 5.4113 6.5104 5.9669 4.2125 4.6775 4.9220 4.0508 4.3873 5.9301 6.0660 2.8891 4.6741 6.0428 6.2301 4.3193 4.0940 6.5144 5.0296 8.7264 9.1943 5.9900 7.4744 2.2617 3.4422 10.0381 8.0243 3.5411 3.3659 3.6847 4.8496 4.1880 4.7418 5.9809 4.6884 6.8108 3.1670 5.3514 2.6974 12.3002 3.7586 8.0663 7.1172 6.9019 7.0422 7.9622 6.7648 7.9517 6.6852 4.9447 1.9228 2.3104 3.7007 1.2106 1.8115 6.5973 1.8355 2.3254 1.4523 4.9980 3.0482 1.3221 1.3592 1.4140 1.0992 1.3929 1.3937 1.3600 1.3703 1.3289 1.3999 1.4314 3.4572 1.5837 1.6750 4.1404 8.5868 8.6916 6.7913 7.6208 4.2444 2.4195 1.9868 2.2875 1.9772 1.6335 1.5719 1.4475 1.6964 2.0387 1.6167 1.0965 1.0929 1.3122 1.7230 3.3837 4.2088 2.3270 2.3809 2.6691 4.7763 2.2793 2.4702 4.6842 3.0867 2.2561 2.2111 2.3291 1.9530 2.0923 2.3479 2.2361 2.4236 4.4585 2.8345 3.1610 4.5344 5.7630 4.8228 5.2836 6.0007 6.2413 6.8089 5.3224 5.5894 6.1375 1.0889 1.0889 1.0918 1.0896 1.0921 1.0912 1.0913 1.0938 1.0954 1.0959 1.0924 1.0934 1.0993 1.0990 1.0974 1.0996 1.0986 1.0669
irintensity: 0.7905 0.4480 0.2501 5.5855 3.7496 16.1555 0.0075 1.9203 0.5122 0.7607 1.0545 5.4375 0.0764 3.2863 9.1401 2.7667 0.0253 1.3058 0.2550 2.6990 24.7179 4.8805 4.9130 74.5072 26.1198 5.7175 0.5891 4.0019 0.8853 8.7560 1.5222 0.0357 1.5152 0.9451 1.7224 23.4364 12.2641 0.1554 0.0225 245.8522 1.4911 5.8230 20.0189 12.2737 1.3523 16.7559 0.5464 17.1283 2.5696 24.8399 0.7156 3.2387 87.6369 247.4560 0.5378 0.3106 0.1307 3.9696 55.5417 0.5962 0.0029 0.0038 0.6997 0.1155 146.4388 0.0911 2.9188 0.0700 0.3026 0.0523 2.0689 0.3925 23.8309 0.0424 8.5231 0.5837 11.9701 12.4523 0.2165 0.6869 0.2411 6.1586 0.5846 3.7292 20.6176 6.5111 2.4369 1.0521 5.2551 0.9422 1.9342 1.8799 10.7582 2.4678 15.6218 2.3588 2.4418 7.2931 22.7064 24.6986 27.1241 0.2704 44.2564 22.7792 0.4594 0.4676 25.6117 256.6138 48.0247 0.2934 46.0939 180.6769 0.5406 1.5568 114.1764 3.1269 74.0412 5.3193 44.4669 18.2288 18.7248 204.3751 14.6532 20.4891 108.4793 10.2957 0.0267 8.9682 12.3661 2.7616 12.6465 0.5532 0.2844 1.7374 0.0170 0.2731 2.3843 0.9602 1.3529 7.9544 0.5430 5.1063 0.9604 116.4095
temp: 298.150 k
press: 1.00000 atm
elementType: 7 44 7 7 7 7 6 6 6 6 6 1 1 1 6 6 6 6 6 1 1 1 1 6 6 6 6 6 1 1 1 1 6 6 6 6 1 6 6 6 6 1 1 1 1 1 8 7 7 1
symmnumber: 1
zpe: 1003245.7 jmol-1
zpe.correction: 0.382116 hartree
zpe.thermalcorrener: 0.407332 hartree
zpe.thermalcorrenthalpy: 0.408276 hartree
zpe.thermalcorrgfe: 0.326418 hartree
zpe.sumelectzpe: -1439.228298 hartree
zpe.sumelectthermal: -1439.203083 hartree
zpe.sumelectthermalent: -1439.202138 hartree
zpe.sumelectthermalfe: -1439.283997 hartree
dipole: -7.5470 0.0010 3.1548
dipole: 8.1799
quadrupole: -103.5695 -96.2893 -157.8114
quadrupole: 0.0077 -23.4826 0.0027
quadrupole: 15.6539 22.9341 -38.5880 0.0077 -23.4826 0.0027
hfenergy: -1439.6104146 hartree
pointgroup: C01 [X(C23H18N7O1Ru1)]
dipole: 2.9692315 -0.0004015 1.2411979 debye
polarizability: 660.2855939|0.0012054|572.6419949|38.6108852|0.0050965|434.6017564 unknown
InChI: InChI=1S/C15H11N3.C8H6N4.H2O.Ru/c1-3-10-16-12(6-1)14-8-5-9-15(18-14)13-7-2-4-11-17-13;1-3-9-7(10-4-1)8-11-5-2-6-12-8;;/h1-11H;1-6H;1H2;/q-3;-2;;+6/p-1
charge 2 multiplicity 2
50 atoms
N  -0.782664 0.000288 1.368704
Ru 0.000447 -0.000026 -0.587885
N  0.365385 2.04821 -0.348193
N  0.364845 -2.048354 -0.347804
N  -2.067989 0.000106 -0.918821
N  1.953003 -0.000253 -0.192198
C  4.656564 -0.000578 0.241003
C  2.591882 1.188397 -0.074161
C  2.591569 -1.189054 -0.073989
C  3.971831 -1.213663 0.142921
C  3.97216 1.212674 0.142715
H  4.500117 -2.154252 0.236759
H  4.500704 2.153136 0.236371
H  5.727743 -0.000707 0.40719
C  1.154754 -4.69681 -0.088302
C  1.689389 -2.34975 -0.157834
C  -0.549272 -3.035659 -0.397171
C  -0.190099 -4.374648 -0.273672
C  2.10342 -3.67553 -0.026601
H  -1.578499 -2.730282 -0.542659
H  -0.956002 -5.139436 -0.323563
H  3.151025 -3.905162 0.125521
H  1.465602 -5.730778 0.01199
C  1.155928 4.696503 -0.088822
C  1.689996 2.349304 -0.158154
C  -0.548474 3.035746 -0.397729
C  -0.188984 4.374655 -0.274305
C  2.104334 3.674993 -0.02697
H  -1.577759 2.73061 -0.543305
H  -0.954699 5.139623 -0.324334
H  3.151982 3.904374 0.125245
H  1.46702 5.730401 0.011431
C  -4.780269 0.000194 -1.048033
C  -2.663506 -0.000131 -2.129199
C  -2.862739 0.000352 0.179971
C  -4.046688 -0.00011 -2.235096
H  -4.531519 -0.000317 -3.203218
C  -2.09177 0.000848 3.745953
C  -2.137225 0.000493 1.467861
C  -0.06386 0.000328 2.510387
C  -0.697003 0.0006 3.744844
H  1.014749 0.000141 2.406508
H  -0.126327 0.000624 4.664786
H  -2.652025 0.001071 4.674663
H  -5.864894 0.000235 -1.058739
H  -2.002993 -0.000325 -2.988628
O  0.374178 -0.000135 -2.507284
N  -2.815455 0.000781 2.614664
N  -4.195417 0.000413 0.16056
H  1.329095 -0.000015 -2.702885
