program: Gaussian 09
title: tpssh-Ru-4-OH-LS-freq
version: ES64L-G09RevE.01
frameworkgroup: C1[X(C26H23N4O4Ru)]
method: UTPSSh
basis: Gen
operation: Freq
keyword: #p
keyword: freq
keyword: utpssh/gen
keyword: pseudo=read
keyword: scrf=(SMD,
keyword: solvent=h2o)
title: #p freq utpssh/gen pseudo=read scrf=(SMD, solvent=h2o)
basis: NPDir=0 NMtPBC= 1 NCelOv= 1 NCel= 1 NClECP= 1 NCelD= 1
basis: NCelK= 1 NCelE2= 1 NClLst= 1 CellRange= 0.0.
basis: One-electron integrals computed using PRISM.
basis: 1 Symmetry operations used in ECPInt.
basis: ECPInt: NShTT= 24753 NPrTT= 133564 LenC2= 19021 LenP2D= 58217.
basis: LDataN: DoStor=T MaxTD1= 6 Len= 172
basis: NBasis= 652 RedAO= T EigKep= 2.52D-04 NBF= 652
basis: NBsUse= 652 1.00D-06 EigRej= -1.00D+00 NBFU= 652
converged: YES YES NO NO
polarizability: 5.67594855e+02 1.62980890e+02 8.42288582e+02 4.32913206e+00 7.88891426e+01 6.69727860e+02
1716.lowfreq: -25.0936 -5.9462 0.0006 0.0007 0.0009 11.3365 21.8746 26.2374 31.3001
frequency: 21.5980 26.1470 31.2118 33.2754 33.9669 40.3920 44.8931 53.3091 61.4729 72.8910 87.6488 101.8039 117.9565 125.7964 160.1082 169.4588 173.1001 175.6487 179.6330 198.2705 210.5667 213.8888 228.8519 250.7374 257.5560 275.7874 284.0715 297.3908 306.5808 309.2278 320.8513 326.1433 348.0963 354.3487 364.8549 366.8989 400.4617 402.7400 409.6687 451.7057 469.1848 490.8670 497.6312 500.5448 524.5310 526.1600 531.3143 547.6773 551.3625 557.4874 573.6848 581.9772 608.6635 643.5141 656.5996 669.7947 671.0233 690.6971 696.2861 723.2776 724.6572 741.6996 751.5814 763.4230 775.4428 801.9902 819.3896 823.1488 824.3443 828.1193 831.0614 872.1958 874.2256 876.5274 879.3586 894.2436 933.1417 946.6150 969.5011 977.0150 983.8491 993.5926 994.3622 994.7902 1000.6928 1004.3262 1014.4967 1016.2876 1030.3611 1040.3413 1042.9434 1059.6927 1059.9744 1061.1756 1073.0099 1080.1039 1085.4751 1109.9248 1139.4599 1141.1626 1153.7281 1165.7648 1181.8042 1205.6570 1228.1964 1229.8660 1241.3061 1255.5423 1262.0423 1262.4722 1288.6350 1302.5100 1324.0405 1324.6424 1327.2668 1342.4584 1365.9030 1366.5944 1372.6841 1417.0253 1417.4640 1418.7691 1429.9166 1457.0195 1457.5054 1459.8550 1477.6065 1484.6849 1484.9817 1489.8837 1492.3847 1497.3534 1530.9538 1539.6339 1541.6711 1559.3978 1581.8346 1584.0261 1599.1340 1599.6267 1626.7390 1641.0377 1657.9236 1662.1091 1662.7948 3054.5307 3054.8964 3122.5781 3123.6141 3155.2511 3155.5497 3213.4415 3219.1362 3220.0818 3220.1538 3220.9002 3222.0984 3223.8486 3228.9945 3231.0247 3236.0342 3240.3755 3240.9636 3252.6975 3256.9168 3267.3409 3617.5382 3730.9299
redmass: 4.6479 3.8950 1.1185 1.1165 3.1352 4.5657 4.9616 4.0821 5.6651 5.5384 6.0334 4.8884 5.2959 4.6973 5.5932 5.4310 6.8562 5.6559 6.1960 6.5411 5.7153 6.7003 8.1112 7.0693 6.4501 4.9024 2.4425 5.0453 4.8679 5.9762 2.9353 4.6824 3.5736 3.0063 4.8343 5.6876 2.7567 2.8022 9.5496 4.3418 8.0937 4.4908 2.9295 2.9778 4.6837 2.4935 1.6719 6.5254 6.7096 5.6274 3.7382 6.4034 7.9448 8.1108 5.7089 6.9224 6.9152 4.4711 6.2971 3.3926 3.4677 7.7203 4.2198 2.0799 1.4159 8.8434 1.8167 2.6077 2.0253 2.3352 2.0695 5.4078 1.2582 1.5140 1.2521 6.4681 1.3998 1.1041 1.3588 1.2918 1.2866 5.4231 1.3349 1.4794 1.3744 1.3080 1.4355 1.4386 6.0010 6.2107 5.3110 1.6903 1.7414 2.1640 1.8793 2.2851 2.2824 2.8952 1.3759 1.3714 1.6315 1.5414 1.2576 2.1937 1.4426 1.4840 3.1994 1.7452 2.0458 2.0664 2.6782 1.8367 6.5799 6.5223 6.0916 4.5193 1.3767 1.3773 5.6907 1.2519 1.3148 3.1431 3.3145 2.1568 3.4353 1.8789 2.7754 1.1876 1.2370 1.0657 1.0736 2.9007 3.7326 2.1441 2.1397 4.8029 10.7131 5.1604 5.4064 5.3858 5.1984 8.1115 6.9149 5.4430 5.4513 1.0390 1.0388 1.0967 1.0967 1.1048 1.1044 1.0869 1.0899 1.0911 1.0879 1.0915 1.0901 1.0918 1.0942 1.0922 1.0984 1.0957 1.0970 1.0934 1.0938 1.0924 1.0825 1.0668
irintensity: 1.5483 3.6088 0.8651 0.8320 0.9838 3.1740 6.8709 1.4231 3.5239 3.6176 6.4478 1.2213 1.9554 1.2984 1.5747 5.5810 2.6284 0.7827 0.4848 6.3747 2.2965 6.7741 10.5460 1.6797 13.4208 31.4354 165.3236 7.2002 56.2857 19.2409 63.0128 61.0747 17.3701 3.1152 61.0548 22.9868 1.1184 5.2736 8.9689 10.3087 11.3129 3.0194 24.6656 16.1355 142.7241 90.4981 102.0137 118.4111 167.7668 16.3324 3.0703 13.1792 6.4674 20.3227 4.7915 0.1221 0.6726 4.6285 16.2530 11.4923 16.2898 8.7356 6.3604 135.6201 72.9651 119.9415 41.2111 8.4433 17.2513 36.7381 49.3414 11.8448 0.8897 2.1723 2.0010 8.2134 0.3162 182.5025 5.0403 1.7670 0.9614 27.3493 1.4245 4.6888 0.8872 0.0158 0.5265 1.7458 46.4730 30.8014 40.2947 17.7207 16.2298 0.1928 46.6759 91.6429 5.6270 1.6056 5.9783 5.6180 175.7551 103.0020 7.6070 536.3662 86.7537 22.9750 60.2690 11.8762 0.3628 1.9254 342.3224 144.9825 267.7623 110.9331 0.5956 192.9955 5.2248 5.0904 52.3663 4.0601 19.3810 112.1596 114.9675 43.7327 39.9810 23.8688 87.2222 47.6918 37.7626 15.4145 17.2248 36.3210 30.1469 32.6337 7.9689 287.4407 1639.2654 35.6179 4.8048 7.6447 86.7702 120.9842 6.3070 120.8818 175.6557 12.8072 10.1520 19.3503 21.1281 20.0035 22.4624 2.7256 4.4268 2.3556 2.2890 4.3027 2.3633 2.5278 8.6493 5.8434 57.2133 3.8731 12.5735 4.2615 7.1653 11.6837 342.2715 138.3373
temp: 298.150 k
press: 1.00000 atm
elementType: 44 7 6 6 6 1 6 1 6 1 1 7 6 6 6 1 6 1 6 1 1 6 1 1 1 6 1 1 1 8 8 6 6 6 6 1 6 6 1 1 1 6 7 7 6 6 6 6 1 6 6 1 1 1 6 8 8 1
symmnumber: 1
zpe: 1174232.4 jmol-1
zpe.correction: 0.447242 hartree
zpe.thermalcorrener: 0.478960 hartree
zpe.thermalcorrenthalpy: 0.479904 hartree
zpe.thermalcorrgfe: 0.381242 hartree
zpe.sumelectzpe: -1618.093593 hartree
zpe.sumelectthermal: -1618.061875 hartree
zpe.sumelectthermalent: -1618.060931 hartree
zpe.sumelectthermalfe: -1618.159593 hartree
dipole: 5.6893 11.4034 12.0832
dipole: 17.5616
quadrupole: -117.6633 -197.5693 -162.5975
quadrupole: -14.3477 -7.8589 -0.5917
quadrupole: 41.6134 -38.2926 -3.3208 -14.3477 -7.8589 -0.5917
hfenergy: -1618.5408349 hartree
pointgroup: C01 [X(C26H23N4O4Ru1)]
dipole: 2.2383383 4.4864544 4.7539047 debye
polarizability: 567.594863|162.9808971|842.288574|4.329134|78.8891425|669.7278598 unknown
InChI: InChI=1S/C14H8N2O3.2C6H7N.H2O.Ru/c17-11-7-2-1-4-8(11)13-15-10-6-3-5-9(14(18)19)12(10)16-13;2*1-6-2-4-7-5-3-6;;/h1-7,15H;2*2-5H,1H3;1H2;/q-3;2*-1;;+6/p-1
charge 1 multiplicity 3
58 atoms
Ru 0.036184 -0.063376 -1.018361
N  2.079008 -0.591602 -0.955298
C  2.523179 -1.640602 -0.226279
C  2.970182 0.106838 -1.69641
C  3.856198 -2.024958 -0.227676
H  1.78436 -2.17561 0.356616
C  4.316389 -0.22785 -1.738577
H  2.575323 0.944991 -2.259042
C  4.794003 -1.319458 -0.997505
H  4.15706 -2.879725 0.368781
H  4.986397 0.361723 -2.355229
N  -2.029401 0.388097 -1.14597
C  -2.596281 1.350525 -0.383167
C  -2.811561 -0.306104 -2.001577
C  -3.949122 1.647851 -0.45815
H  -1.94076 1.888673 0.290335
C  -4.173594 -0.058898 -2.118333
H  -2.317855 -1.066372 -2.593682
C  -4.779601 0.936754 -1.338413
H  -4.34986 2.435902 0.170682
H  -4.755769 -0.643941 -2.822361
C  6.246264 -1.702604 -1.009147
H  6.767795 -1.204857 -0.182574
H  6.369043 -2.780445 -0.875607
H  6.727736 -1.39477 -1.94041
C  -6.253479 1.217801 -1.419565
H  -6.78028 0.667857 -0.630249
H  -6.458038 2.281413 -1.270783
H  -6.665096 0.900996 -2.380616
O  0.547156 1.793402 -0.84458
O  -0.442876 -2.022296 -0.983873
C  0.928636 2.558831 0.172999
C  1.457184 3.827452 -0.162953
C  0.822011 2.176994 1.547228
C  1.887001 4.693564 0.829443
H  1.519187 4.088734 -1.213802
C  1.263326 3.082055 2.530229
C  1.792885 4.320672 2.181759
H  2.299526 5.659812 0.558721
H  1.200188 2.813164 3.579305
H  2.132947 4.995628 2.959374
C  0.246978 0.901732 1.908996
N  -0.080575 -0.068693 1.040019
N  -0.062714 0.50663 3.17748
C  -0.60884 -0.761238 3.127334
C  -1.097457 -1.617864 4.11553
C  -0.606559 -1.117043 1.763026
C  -1.581837 -2.852326 3.683045
H  -1.098292 -1.33729 5.162646
C  -1.075195 -2.370424 1.330644
C  -1.565948 -3.22408 2.325123
H  -1.97352 -3.551742 4.413686
H  -1.933979 -4.202079 2.035563
H  0.066768 1.060527 4.016658
C  -0.996571 -2.813451 -0.087685
O  -1.407708 -3.938493 -0.430407
O  0.028621 -0.090383 -2.986638
H  0.900095 -0.357898 -3.329263
