program: Gaussian 09
title: tpssh-Ru-4-VAC-LS
version: ES64L-G09RevE.01
frameworkgroup: C1[X(C26H22N4O3Ru)]
method: UTPSSh
basis: Gen
operation: FOpt
keyword: #p
keyword: opt
keyword: utpssh/gen
keyword: pseudo=read
keyword: scrf=(SMD,
keyword: solvent=h2o)
title: #p opt utpssh/gen pseudo=read scrf=(SMD, solvent=h2o)
basis: NPDir=0 NMtPBC= 1 NCelOv= 1 NCel= 1 NClECP= 1 NCelD= 1
basis: NCelK= 1 NCelE2= 1 NClLst= 1 CellRange= 0.0.
basis: One-electron integrals computed using PRISM.
basis: 1 Symmetry operations used in ECPInt.
basis: ECPInt: NShTT= 23005 NPrTT= 124924 LenC2= 17884 LenP2D= 55414.
basis: LDataN: DoStor=T MaxTD1= 6 Len= 172
basis: NBasis= 629 RedAO= T EigKep= 2.76D-04 NBF= 629
basis: NBsUse= 629 1.00D-06 EigRej= -1.00D+00 NBFU= 629
converged: YES YES YES YES
dipole: 5.2964 8.9946 6.7351
dipole: 12.4224
quadrupole: -122.4291 -209.4941 -153.3469
quadrupole: -22.7599 -5.3430 -15.6003
quadrupole: 39.3276 -47.7374 8.4098 -22.7599 -5.3430 -15.6003
hfenergy: -1542.7257276 hartree
pointgroup: C01 [X(C26H22N4O3Ru1)]
dipole: 2.0440312 0.6166895 4.3963364 debye
InChI: InChI=1S/C14H8N2O3.2C6H7N.Ru/c17-11-7-2-1-4-8(11)13-15-10-6-3-5-9(14(18)19)12(10)16-13;2*1-6-2-4-7-5-3-6;/h1-7,15H;2*2-5H,1H3;/q-3;2*-1;+5
charge 1 multiplicity 2
56 atoms
Ru 0.29798851 -0.08308328 0.05210655
N  0.27451408 2.01906965 0.19115168
C  1.05828168 2.80411229 -0.5822473
C  -0.5548096 2.61346725 1.08037564
C  1.03907201 4.18905217 -0.48767935
H  1.69980718 2.29717961 -1.29309026
C  -0.62059103 3.99212852 1.22457119
H  -1.17190914 1.94950051 1.67500428
C  0.18978714 4.82130329 0.43311213
H  1.68443047 4.77085913 -1.13742469
H  -1.3071319 4.41500559 1.95046673
N  0.32024438 -2.19037213 -0.10587561
C  1.1343583 -2.95499344 0.65773252
C  -0.49442535 -2.8038472 -0.9925441
C  1.15825734 -4.33865298 0.55513751
H  1.7679747 -2.43035446 1.36328167
C  -0.52090436 -4.18508541 -1.14089956
H  -1.13047679 -2.15666636 -1.58488163
C  0.32021926 -4.99269637 -0.36211023
H  1.83064722 -4.90267122 1.19317929
H  -1.19857864 -4.62495105 -1.86505752
C  0.16276682 6.31643816 0.57987602
H  0.87315461 6.62620636 1.35610044
H  0.45223026 6.80947111 -0.35140837
H  -0.82845137 6.66439088 0.88160426
C  0.3425074 -6.48813603 -0.5114729
H  1.23046558 -6.7944764 -1.07724283
H  0.39492446 -6.97731742 0.46555576
H  -0.54019722 -6.84669745 -1.04563832
O  0.31705932 -0.27566676 2.00933265
O  0.27427293 -0.07577104 -2.0065823
C  1.26922568 0.16448537 2.84238255
C  0.9026486 0.33034964 4.19594905
C  2.62438984 0.41301221 2.45979273
C  1.82717313 0.74759976 5.14251955
H  -0.12782606 0.12572028 4.46844206
C  3.54597868 0.82773342 3.44946322
C  3.15822593 1.0006823 4.77037346
H  1.51545358 0.87995323 6.17403266
H  4.57621873 1.03339811 3.17656009
H  3.88224886 1.33135781 5.50708361
C  3.06165396 0.2015424 1.09699366
N  2.24899455 0.01595893 0.03994746
N  4.35739534 0.14227946 0.66867877
C  4.37551447 -0.07877369 -0.69826579
C  5.41389403 -0.21455186 -1.61998067
C  3.02429336 -0.14827558 -1.09007822
C  5.04248544 -0.40295183 -2.95300733
H  6.4538418 -0.17119076 -1.31627937
C  2.64542501 -0.29925406 -2.43502629
C  3.69444138 -0.43088555 -3.35397218
H  5.81653605 -0.51560715 -3.70465923
H  3.4517285 -0.54546442 -4.40465526
H  5.17482239 0.20255627 1.26425283
C  1.22280558 -0.22406666 -2.89070367
O  0.95718407 -0.28260701 -4.11399016
