program: Gaussian 09
title: tpssh-Fe-20-OH-LS-freq
version: ES64L-G09RevE.01
frameworkgroup: C1[X(C17H15Cl2F2FeN4O5)]
method: RTPSSh
basis: Gen
operation: Freq
keyword: #p
keyword: freq
keyword: tpssh/gen
keyword: scrf=(smd,solvent=h2o)
keyword: pseudo=read
title: #p freq tpssh/gen scrf=(smd,solvent=h2o) pseudo=read
basis: NPDir=0 NMtPBC= 1 NCelOv= 1 NCel= 1 NClECP= 1 NCelD= 1
basis: NCelK= 1 NCelE2= 1 NClLst= 1 CellRange= 0.0.
basis: One-electron integrals computed using PRISM.
basis: 1 Symmetry operations used in ECPInt.
basis: ECPInt: NShTT= 17955 NPrTT= 101206 LenC2= 15053 LenP2D= 48220.
basis: LDataN: DoStor=T MaxTD1= 6 Len= 172
basis: NBasis= 584 RedAO= T EigKep= 1.52D-04 NBF= 584
basis: NBsUse= 584 1.00D-06 EigRej= -1.00D+00 NBFU= 584
converged: YES YES NO NO
title: Mulliken charges:
elementType: Fe N N N N C C C C C H C H C C O C H H H C H H H C C O C H H H C H H H C C C O O F F O H Cl Cl
charge: 0.240585 -0.561851 -0.360611 -0.414462 -0.551619 0.278071 0.276694 -0.108162 -0.115752 -0.157220 0.222763 -0.150552 0.213578 0.068802 0.638348 -0.576674 -0.371545 0.164621 0.154443 0.161863 -0.380534 0.154847 0.168037 0.156518 0.604096 0.066656 -0.672196 -0.381793 0.158356 0.165173 0.163426 -0.376531 0.167764 0.157141 0.157018 0.544481 0.565755 0.557113 -0.687467 -0.562236 -0.340332 -0.329808 -0.563456 0.424338 0.013882 0.018435
chargesum: -1.00000
title: Mulliken charges with hydrogens summed into heavy atoms:
elementType: Fe N N N N C C C C C C C C O C C C C O C C C C C O O F F O Cl Cl
charge: 0.240585 -0.561851 -0.360611 -0.414462 -0.551619 0.278071 0.276694 0.114600 0.097826 -0.157220 -0.150552 0.068802 0.638348 -0.576674 0.109382 0.098868 0.604096 0.066656 -0.672196 0.105161 0.105392 0.544481 0.565755 0.557113 -0.687467 -0.562236 -0.340332 -0.329808 -0.139118 0.013882 0.018435
polarizability: 7.44538086e+02 -3.59715334e+01 5.63344206e+02 -6.01220683e+00 -9.43644332e-01 3.01631905e+02
1716.lowfreq: -7.4249 -1.7654 0.0017 0.0030 0.0031 12.6439 20.5574 28.3086 38.8957
frequency: 14.1261 25.6848 38.7618 45.5749 60.2858 67.8922 81.4812 96.7473 111.1390 121.1065 148.6468 153.8906 166.6679 168.5359 180.4711 196.4325 200.8321 218.7948 220.6956 231.1593 232.6304 237.4973 243.3525 247.8706 254.5040 259.9188 270.8719 274.1781 280.1001 294.7719 310.4156 325.1221 332.9458 341.6535 354.6993 366.8011 380.5961 397.2768 408.4836 418.9793 427.2229 461.1400 466.7529 478.6684 489.1285 496.8750 504.3692 515.9045 521.9090 545.3564 577.2384 622.9217 640.3572 659.0600 680.7932 687.7971 701.4664 714.3621 724.2280 749.9832 757.6201 772.8389 812.1537 828.7628 860.0609 869.0554 881.6613 897.8006 914.3024 943.7033 945.7489 948.0695 950.0072 979.2583 990.4484 1003.7501 1005.8732 1017.7827 1020.5604 1028.1454 1097.1591 1118.5823 1125.7272 1157.8503 1166.5465 1172.5485 1187.1405 1191.5500 1210.1319 1237.0479 1257.3571 1279.2179 1315.0589 1346.3194 1358.3003 1381.0971 1388.9045 1393.0215 1402.6441 1407.4751 1419.2130 1423.6609 1468.0359 1485.1285 1485.3353 1493.7758 1496.0125 1497.2639 1498.5012 1508.2758 1509.7261 1575.9446 1580.3011 1613.7521 1617.7249 1635.6549 1653.3077 3057.3915 3062.7078 3064.5691 3065.1447 3137.5786 3140.4241 3141.5380 3141.6844 3156.8283 3165.8569 3172.1327 3173.6216 3263.8772 3279.1976 3657.3013
redmass: 4.0541 9.9165 7.1936 10.0661 8.5620 8.2925 6.3788 9.6537 6.9316 7.0003 6.1768 3.9272 5.7517 4.0537 1.4888 1.9911 9.7960 4.5319 5.8972 4.3795 1.1027 4.3191 2.2518 8.6196 2.0295 3.4396 3.5586 2.7950 2.8549 3.6749 6.2741 6.9055 5.7975 7.0478 7.4880 12.6193 11.8484 6.9729 6.1155 5.0278 7.4251 5.2073 5.8372 6.2334 4.9497 4.9196 1.4747 8.6645 5.3040 9.7655 7.1686 8.1704 5.3634 6.2313 9.3535 6.4853 8.5591 7.6383 5.2346 6.8825 6.6499 10.8850 5.3170 3.5275 1.5065 4.4284 1.4266 3.3221 4.4575 3.7743 1.7600 1.4998 1.1532 6.5826 7.7675 3.5209 3.8794 1.3250 1.3505 4.5068 8.8836 2.6167 2.4746 5.2544 3.7068 3.7551 3.8538 2.8851 3.1414 1.5661 2.5974 4.6799 7.3650 9.2443 9.2919 3.5392 1.2138 1.3292 1.4190 1.8533 3.2069 6.1924 3.3257 1.0479 1.0497 1.0473 1.0578 1.0625 1.0628 1.0649 1.0619 10.4409 8.7923 9.7198 11.4242 11.7018 11.5849 1.0347 1.0350 1.0358 1.0357 1.1029 1.1033 1.1030 1.1029 1.1027 1.1018 1.1018 1.1014 1.0927 1.0921 1.0661
irintensity: 1.0381 0.9818 1.4057 0.9521 5.0775 0.3826 22.4317 4.2684 8.6808 4.3777 12.5224 26.3500 12.0268 6.3277 8.2067 6.5814 8.1003 23.9751 6.4943 3.5067 0.6829 2.4094 13.8653 4.3032 4.6091 14.6021 20.5829 2.5337 16.1745 44.3224 15.5554 13.3036 63.5394 16.3673 6.4551 66.1277 36.5239 6.4545 9.7641 21.0514 104.2175 32.7974 28.9359 39.8683 22.4058 5.9941 359.9316 122.4997 23.6744 75.8069 11.3854 2.1464 11.8246 13.4802 319.7017 113.6214 18.4279 6.3255 5.3564 32.8461 5.7352 79.9049 59.3668 57.6306 12.1710 77.0022 80.8766 65.0281 14.7390 171.5688 42.2709 23.4887 355.5438 62.7145 424.2024 101.2138 134.9138 2.5056 5.7193 47.0012 147.1280 249.0687 137.4473 384.3825 10.1685 12.7166 248.0896 48.6796 186.0715 92.6363 6.1257 44.6558 812.2077 611.2880 38.0919 152.6091 4.4857 24.6858 68.0515 85.3372 494.4946 441.8912 185.8555 1.9175 5.9779 6.7769 36.3582 53.0416 39.0270 6.2711 2.0552 158.6124 907.0030 1040.0621 831.4767 2429.5756 525.7390 35.6077 43.6165 27.8795 18.7372 34.7382 22.0457 42.2442 42.9941 19.9663 16.9822 12.7061 11.7271 8.6221 18.3519 257.6682
temp: 298.150 k
press: 1.00000 atm
elementType: 26 7 7 7 7 6 6 6 6 6 1 6 1 6 6 8 6 1 1 1 6 1 1 1 6 6 8 6 1 1 1 6 1 1 1 6 6 6 8 8 9 9 8 1 17 17
symmnumber: 1
zpe: 823688.0 jmol-1
zpe.correction: 0.313726 hartree
zpe.thermalcorrener: 0.343585 hartree
zpe.thermalcorrenthalpy: 0.344529 hartree
zpe.thermalcorrgfe: 0.253357 hartree
zpe.sumelectzpe: -2495.477372 hartree
zpe.sumelectthermal: -2495.447513 hartree
zpe.sumelectthermalent: -2495.446569 hartree
zpe.sumelectthermalfe: -2495.537741 hartree
dipole: 6.7518 -1.7591 0.4588
dipole: 6.9923
quadrupole: -302.4381 -234.2887 -202.0903
quadrupole: -6.1797 -1.8871 -2.7675
quadrupole: -56.1657 11.9837 44.1821 -6.1797 -1.8871 -2.7675
hfenergy: -2495.791098 hartree
pointgroup: C01 [X(C17H15Cl2F2Fe1N4O5)]
dipole: -2.656368 0.6920867 0.1805135 debye
polarizability: 744.5380817|-35.9715433|563.3442102|6.0122069|0.943644|301.6319054 unknown
InChI: InChI=1S/C17H14Cl2F2N4O4.Fe.H2O/c1-15(2)11(26)22-9-5-7(18)8(19)6-10(9)23-12(27)16(3,4)25-14(29)17(20,21)13(28)24-15;;/h5-6H,1-4H3;;1H2/q-4;+5;/p-1
charge -1 multiplicity 1
46 atoms
Fe 0.784303 -0.023272 0.333449
N  -0.506887 1.147134 -0.162165
N  2.016066 1.453701 -0.004402
N  1.854118 -1.417201 -0.226823
N  -0.604073 -1.307068 0.204155
C  -1.822405 0.662966 -0.06439
C  -1.872512 -0.741513 0.15894
C  -3.009159 1.398912 -0.182341
C  -3.105545 -1.396319 0.258156
C  -4.230532 0.736027 -0.068756
H  -2.984727 2.46487 -0.352808
C  -4.279044 -0.651239 0.149173
H  -3.148306 -2.461985 0.434575
C  1.354913 2.7431 -0.296779
C  -0.145893 2.468025 -0.385377
O  -0.963829 3.366114 -0.612358
C  1.577782 3.750694 0.851104
H  2.641128 3.988331 0.926445
H  1.02273 4.671521 0.652388
H  1.237192 3.328988 1.802062
C  1.779929 3.337843 -1.656963
H  1.149184 4.202132 -1.881833
H  2.821145 3.658715 -1.622044
H  1.659487 2.59715 -2.453576
C  -0.288633 -2.56933 -0.175274
C  1.212064 -2.752362 -0.446122
O  -1.100197 -3.497468 -0.367591
C  1.766824 -3.808001 0.528566
H  1.17737 -4.723008 0.422453
H  2.80955 -4.037863 0.303749
H  1.689162 -3.459033 1.562544
C  1.346873 -3.207832 -1.913563
H  2.392029 -3.396324 -2.160316
H  0.777581 -4.131171 -2.049328
H  0.94797 -2.447105 -2.591558
C  3.33752 1.364332 -0.022501
C  3.205686 -1.316686 -0.332959
C  3.868899 -0.056476 0.290834
O  4.18978 2.263169 -0.233728
O  3.959854 -2.191387 -0.779699
F  5.195916 -0.100331 -0.028864
F  3.818978 -0.239406 1.678293
O  0.792777 0.097615 2.058197
H  1.327129 0.88012 2.305626
Cl -5.697129 1.678564 -0.195136
Cl -5.806801 -1.48361 0.303529
