program: Gaussian 09
title: tpssh-Fe-20-OOH-triplet
version: ES64L-G09RevE.01
frameworkgroup: C1[X(C17H15Cl2F2FeN4O6)]
method: UTPSSh
basis: Gen
operation: Freq
keyword: #P
keyword: Geom=AllCheck
keyword: Guess=TCheck
keyword: SCRF=Check
keyword: GenChk
keyword: UTPSSh/ChkBas
keyword: Freq
converged: YES YES NO YES
polarizability: 8.15507766e+02 -5.07832874e+00 5.77439285e+02 2.03709364e+01 -5.25731503e+00 3.46066921e+02
1716.lowfreq: -6.3425 0.0011 0.0016 0.0017 7.3477 14.2273 30.1442 33.9599 39.0850
frequency: 28.8636 33.1389 39.0666 44.8957 52.1109 66.0694 74.6201 76.1993 100.3025 102.7478 118.9625 130.0693 152.3887 163.4946 167.6244 176.4481 194.7572 198.7026 202.2424 223.1849 227.1920 229.9088 234.9867 236.3799 239.5370 248.4776 251.5089 255.6508 265.3442 269.2195 284.4171 297.1911 308.4229 322.0956 328.9922 342.0722 348.0620 369.6776 373.5812 390.7141 398.2136 411.8004 412.8990 439.3363 442.1741 465.9361 467.8489 489.6949 492.9613 507.6458 517.9077 528.4674 548.1629 575.9114 622.5106 638.7142 660.1623 685.9044 700.8074 716.5000 724.6904 750.3983 755.1693 777.8825 812.8424 830.5904 863.2499 867.1568 881.3986 895.5947 901.4252 912.3558 943.7184 945.1179 946.2315 979.1183 986.3897 1004.1020 1005.8996 1015.8238 1016.2167 1028.3964 1102.6590 1115.2494 1130.5823 1155.4887 1167.1481 1167.9262 1185.6170 1196.6233 1203.6049 1230.5631 1258.5111 1276.0461 1346.3465 1352.8433 1362.3265 1379.5638 1385.2610 1387.6245 1387.7666 1404.2261 1405.0013 1414.7119 1426.3726 1466.9029 1484.7076 1484.8060 1493.8272 1493.9764 1496.5333 1497.1255 1507.3043 1507.3800 1578.5147 1588.2897 1601.5214 1605.9739 1627.2273 1631.2150 3059.2411 3061.0705 3062.0113 3063.4228 3137.8692 3138.9787 3139.1989 3141.8397 3160.5591 3161.1456 3170.9756 3172.4197 3267.2230 3268.2305 3662.2724
redmass: 6.7946 8.0254 5.4593 9.1604 9.5403 11.5348 5.3020 7.5244 11.1849 9.1421 6.2441 6.0706 5.7998 4.7856 5.1585 3.8846 4.6110 1.5759 2.2450 7.6847 3.4991 4.8155 1.5745 3.8424 1.3948 5.1138 2.6946 3.4316 2.9532 2.7237 3.7753 7.1826 6.9265 5.9311 6.3724 5.9280 7.7147 11.1957 13.4452 4.3003 1.4225 6.9837 4.5993 6.9621 5.9428 5.7743 5.3718 5.0815 5.5487 10.4219 5.3552 13.5843 11.8036 6.9375 8.3416 5.2779 5.8093 5.1824 9.7512 7.8810 5.1621 7.0133 6.6968 10.8024 5.3329 3.5298 1.6928 3.3225 1.4427 5.0609 5.6976 4.8367 2.9730 1.5371 2.0424 6.4774 7.8505 3.8744 2.9027 1.3396 1.3310 6.0970 8.6197 1.7341 4.9597 5.1831 3.6919 3.7668 4.8597 2.6325 3.0937 1.3749 3.2550 4.5618 7.3981 9.8690 5.4637 6.6164 1.1230 1.2140 1.2141 1.6290 1.3740 4.3026 8.8712 3.3437 1.0489 1.0484 1.0502 1.0497 1.0675 1.0669 1.0620 1.0634 10.4584 7.9669 11.4656 12.2039 10.7134 11.1092 1.0350 1.0349 1.0359 1.0354 1.1030 1.1026 1.1030 1.1032 1.1026 1.1022 1.1016 1.1015 1.0927 1.0929 1.0681
irintensity: 0.6272 0.7055 0.5049 1.6067 14.2368 1.3798 1.2595 12.0667 0.5160 2.4067 4.4659 6.7902 1.5893 5.5866 0.7900 4.9456 12.9362 3.7052 8.2226 10.1126 11.0976 12.5690 2.5094 0.6642 0.7879 4.3581 1.6805 0.4410 2.3350 2.1269 1.5686 19.1347 24.9337 17.9085 30.0802 2.2916 5.3270 277.2898 5.3871 13.0624 153.0454 11.1245 26.0117 138.3912 190.0083 11.9472 8.7521 4.7918 2.0357 164.3347 4.8620 54.3563 88.2691 3.6313 0.2645 10.6633 3.0130 25.5634 27.0859 1.1824 0.7790 25.3953 7.8034 57.2818 83.1197 61.4822 23.8733 37.9998 49.1073 223.3222 435.9781 21.5199 149.9298 10.7741 92.1853 51.3208 314.8341 105.8562 69.0816 4.7078 3.3449 91.0870 8.1749 78.8365 204.3384 456.9996 20.7589 7.9704 281.1931 84.6319 132.7452 61.7182 0.0720 79.2674 625.1334 363.1880 205.8680 438.1955 41.6324 8.8393 6.2501 3.9905 72.5217 993.1393 363.9767 72.0057 5.7750 3.4198 19.9125 9.7625 83.0048 56.6295 4.2091 3.2445 293.2631 617.1416 1167.4793 3434.4315 1195.0903 545.9015 43.1485 45.1197 23.5333 18.6522 19.4823 52.2957 28.7140 39.3458 16.6184 15.3820 12.6497 11.5971 21.8570 3.9379 197.0311
temp: 298.150 k
press: 1.00000 atm
elementType: 26 7 7 7 7 6 6 6 6 6 1 6 1 6 6 8 6 1 1 1 6 1 1 1 6 6 8 6 1 1 1 6 1 1 1 6 6 6 8 8 9 9 8 17 17 8 1
symmnumber: 1
zpe: 830869.1 jmol-1
zpe.correction: 0.316461 hartree
zpe.thermalcorrener: 0.347964 hartree
zpe.thermalcorrenthalpy: 0.348908 hartree
zpe.thermalcorrgfe: 0.253726 hartree
zpe.sumelectzpe: -2570.640801 hartree
zpe.sumelectthermal: -2570.609298 hartree
zpe.sumelectthermalent: -2570.608354 hartree
zpe.sumelectthermalfe: -2570.703536 hartree
dipole: -9.1862 -2.3410 0.8459
dipole: 9.5174
quadrupole: -310.9084 -239.2599 -209.2766
quadrupole: -0.4953 -2.8945 -7.0213
quadrupole: -57.7601 13.8884 43.8717 -0.4953 -2.8945 -7.0213
hfenergy: -2570.9572621 hartree
pointgroup: C01 [X(C17H15Cl2F2Fe1N4O6)]
dipole: -3.6127801 -0.9112947 0.3717184 debye
polarizability: 816.0365101|-7.0087013|577.6078584|11.2507718|2.2555808|345.3696035 unknown
InChI: InChI=1S/C17H14Cl2F2N4O4.Fe.H2O2/c1-15(2)11(26)22-9-5-7(18)8(19)6-10(9)23-12(27)16(3,4)25-14(29)17(20,21)13(28)24-15;;1-2/h5-6H,1-4H3;;1-2H/q-4;+5;/p-1
charge -1 multiplicity 3
47 atoms
Fe 0.75080132 0.02822434 0.18319312
N  -0.58278638 1.27260296 -0.16896782
N  1.9415673 1.48810384 -0.15393463
N  1.92094733 -1.39662988 -0.35147819
N  -0.59286539 -1.19905039 -0.22997739
C  -1.8762832 0.74976532 -0.07902525
C  -1.88247882 -0.67238771 -0.12883331
C  -3.0767636 1.45752802 0.04916791
C  -3.09011508 -1.37543691 -0.05924257
C  -4.2747436 0.74559463 0.11213013
H  -3.07952277 2.5371839 0.09427731
C  -4.28136677 -0.65893337 0.05738055
H  -3.10325213 -2.45555753 -0.09037318
C  1.29014248 2.80897647 -0.36146567
C  -0.22573049 2.58688993 -0.30353536
O  -1.03109445 3.52504144 -0.42038106
C  1.67519537 3.80267526 0.75132643
H  2.74217984 4.0276332 0.70232397
H  1.11402268 4.73145397 0.61720425
H  1.44048855 3.38787102 1.736019
C  1.59207912 3.38471658 -1.76327593
H  0.99161598 4.28586472 -1.91475865
H  2.64788139 3.64300099 -1.84761617
H  1.33661887 2.65678835 -2.5394548
C  -0.24659281 -2.48605237 -0.5361285
C  1.26816478 -2.70192323 -0.6410235
O  -1.05642938 -3.40275226 -0.75535462
C  1.66500062 -3.7686699 0.39943476
H  1.09976065 -4.68507272 0.20855419
H  2.73084459 -3.99212189 0.32611086
H  1.4397602 -3.42058301 1.41226278
C  1.55449664 -3.1806409 -2.08004594
H  2.61107932 -3.42374766 -2.19546966
H  0.95926565 -4.07491148 -2.28385627
H  1.28296623 -2.40533572 -2.80308851
C  3.27432815 1.39094903 -0.21145121
C  3.25807657 -1.31130056 -0.37182622
C  3.84536338 0.00880957 0.19637583
O  4.09426135 2.28929672 -0.49286563
O  4.07136056 -2.19047537 -0.7211285
F  5.18606584 0.01555859 -0.06485801
F  3.7418372 -0.07413289 1.59059681
O  0.36717645 0.24276667 1.96966838
Cl -5.76414761 1.64515151 0.26326404
Cl -5.77887759 -1.55351606 0.14097191
O  1.00125452 -0.75932357 2.74688448
H  0.36637312 -1.50356164 2.70187585
