program: Gaussian 09
title: tpssh-Fe-20-2VAC-HS-freq
version: ES64L-G09RevE.01
frameworkgroup: C1[X(C17H14Cl2F2FeN4O4)]
method: UTPSSh
basis: Gen
operation: Freq
keyword: #P
keyword: Geom=AllCheck
keyword: Guess=TCheck
keyword: SCRF=Check
keyword: GenChk
keyword: UTPSSh/ChkBasFreq
converged: YES YES NO YES
polarizability: 6.31438669e+02 1.03322924e-02 5.37252581e+02 1.31807500e+01 3.18893713e-02 2.47562332e+02
1716.lowfreq: 0.0024 0.0029 0.0029 7.7507 13.0738 14.8371 32.2612 36.7310 39.9234
frequency: 31.2506 36.6693 39.5961 47.8139 65.5367 71.5219 78.1534 103.0458 130.6468 131.5111 163.0056 171.8950 175.2815 194.6196 194.9559 205.3309 210.1329 218.0289 232.5724 234.5888 237.2692 239.7113 249.1241 251.6733 252.9438 253.6353 287.3917 288.9979 319.3701 325.9499 331.5301 341.0727 342.0863 370.6166 371.8094 390.3235 413.4988 417.7665 456.3988 459.7425 462.9554 469.8888 485.9002 494.6126 510.2745 519.5388 542.4975 575.9573 616.5620 632.8691 655.7244 683.1090 700.1681 718.8751 728.0501 753.5069 756.9833 778.4740 808.5498 826.4353 867.0906 877.5826 885.2457 892.0905 913.7699 937.9430 944.7774 944.9156 991.2026 998.5779 1000.3821 1011.9704 1012.3090 1016.4883 1028.7772 1093.3563 1119.2273 1127.5565 1153.1427 1175.5991 1175.6720 1186.4410 1196.0564 1203.5229 1231.3802 1253.2345 1270.6932 1346.8570 1350.4047 1382.8110 1383.1842 1387.8078 1388.4750 1396.0199 1407.6355 1412.2402 1421.6710 1484.9118 1484.9690 1485.6244 1493.0124 1493.1042 1496.7872 1497.2277 1506.6183 1506.7864 1577.3561 1587.8976 1598.6069 1608.1715 1618.6875 1625.5490 3057.3555 3057.3741 3060.3312 3060.4397 3135.0594 3135.0786 3137.8260 3137.8480 3156.1430 3156.1996 3162.3532 3162.3934 3263.0852 3264.1536
redmass: 6.6545 6.9382 4.8528 9.8794 13.9649 5.8221 9.7018 11.8296 5.6359 9.3637 7.8986 2.7666 1.7322 6.9418 1.6204 2.7150 3.2185 2.9109 2.0801 2.1148 2.4386 3.8641 2.2276 2.5679 3.9950 6.0979 3.1900 6.1230 5.6934 8.5129 5.9853 8.7646 7.3873 14.9929 10.7342 6.4316 9.3223 5.0161 12.2971 5.1123 5.5071 5.8927 5.4109 5.0026 9.7796 5.3345 11.1357 7.2977 8.1768 5.1317 5.2205 5.6876 9.0576 8.7305 5.0355 7.1931 6.3863 10.2366 5.7385 3.5760 1.4509 4.5839 1.4154 3.2282 4.8637 6.0986 1.4957 1.5297 6.4128 5.5062 8.3583 1.3575 1.3505 3.0490 4.2455 8.7380 1.6912 5.4077 5.7339 3.7293 3.6773 4.9680 2.6725 2.9258 1.5261 2.5180 4.4496 9.6627 8.0943 2.5007 4.8426 1.2691 1.3512 3.4713 1.7427 1.9110 6.5146 1.0493 1.0494 3.8185 1.0497 1.0490 1.0686 1.0668 1.0651 1.0689 8.7929 10.8870 11.5501 11.4697 9.5172 11.5499 1.0350 1.0350 1.0356 1.0356 1.1029 1.1029 1.1027 1.1027 1.1024 1.1023 1.1018 1.1018 1.0922 1.0925
irintensity: 0.0130 0.0344 1.3401 0.0113 12.5392 0.9717 27.6064 0.0190 0.8268 2.6995 0.3758 0.6692 4.4296 2.2182 0.0322 0.4944 22.0595 4.8071 2.1634 1.0022 0.6082 1.6762 2.1965 0.0502 7.9842 2.1952 2.4410 12.7284 15.9163 23.4711 6.6150 10.3970 1.6240 0.5242 101.8804 1.1954 12.9531 21.3039 156.3999 14.1630 67.5388 34.0453 5.9217 3.4818 145.5545 2.8358 81.4331 6.9182 0.0543 15.2080 6.5543 62.7413 26.5277 0.0039 0.0001 41.5668 0.2186 68.6947 51.6650 56.3397 1.6254 38.4600 94.5659 57.2252 28.1488 202.6117 1.8712 10.6702 21.4990 163.6464 439.5843 2.8920 8.7433 113.5671 30.2522 4.0704 77.3399 63.5051 268.5936 33.2753 0.4316 180.3051 78.6938 133.4853 92.2672 9.1477 37.4225 75.4303 186.1619 4.9353 241.0192 5.6416 16.3382 368.3014 27.4227 928.1961 208.2090 5.5352 5.7604 652.3698 14.4840 8.0374 81.8534 59.7045 10.6502 4.2452 1742.9908 140.8326 1100.4562 581.3530 511.5129 2096.4612 2.6024 95.3363 33.6388 1.6573 46.5379 21.1593 62.2997 32.8971 16.8979 21.3967 13.3700 24.4852 14.9032 2.4528
temp: 298.150 k
press: 1.00000 atm
elementType: 26 7 7 7 7 6 6 6 6 6 1 6 1 6 6 8 6 1 1 1 6 1 1 1 6 6 8 6 1 1 1 6 1 1 1 6 6 6 8 8 9 9 17 17
symmnumber: 1
zpe: 786275.9 jmol-1
zpe.correction: 0.299477 hartree
zpe.thermalcorrener: 0.327706 hartree
zpe.thermalcorrenthalpy: 0.328650 hartree
zpe.thermalcorrgfe: 0.240332 hartree
zpe.sumelectzpe: -2419.721801 hartree
zpe.sumelectthermal: -2419.693572 hartree
zpe.sumelectthermalent: -2419.692628 hartree
zpe.sumelectthermalfe: -2419.780946 hartree
dipole: -6.5264 -0.0006 -1.5030
dipole: 6.6973
quadrupole: -311.5760 -241.9308 -193.4246
quadrupole: -0.0078 -0.4522 -0.0116
quadrupole: -62.5989 7.0463 55.5526 -0.0078 -0.4522 -0.0116
hfenergy: -2420.0212781 hartree
pointgroup: C01 [X(C17H14Cl2F2Fe1N4O4)]
dipole: -2.5561407 0.0076706 -0.639428 debye
polarizability: 630.8068567|-0.3662815|537.026836|20.3227678|-8.241684|248.4198887 unknown
InChI: InChI=1S/C17H14Cl2F2N4O4.Fe/c1-15(2)11(26)22-9-5-7(18)8(19)6-10(9)23-12(27)16(3,4)25-14(29)17(20,21)13(28)24-15;/h5-6H,1-4H3;/q-4;+4
charge -1 multiplicity 4
44 atoms
Fe 0.82242129 -0.00693449 -0.14272455
N  -0.56379791 -1.25286047 0.03631311
N  1.97413356 -1.49388176 0.17969635
N  2.00411819 1.47213599 0.09721132
N  -0.53820822 1.27483334 -0.03361494
C  -1.85467303 -0.68842773 -0.01961196
C  -1.84025948 0.7343689 -0.05890785
C  -3.06986589 -1.37598866 -0.03306239
C  -3.04130428 1.44459295 -0.11086399
C  -4.26701019 -0.65322322 -0.08477109
H  -3.08884676 -2.45634224 -0.00559262
C  -4.25285583 0.74444198 -0.12331024
H  -3.03841332 2.52498106 -0.1429409
C  1.28487395 -2.78642883 0.45057779
C  -0.23290865 -2.54538836 0.30334073
O  -1.04584323 -3.48013303 0.45184268
C  1.70365875 -3.86020612 -0.57016837
H  2.76418021 -4.09581941 -0.46067174
H  1.12436374 -4.7715167 -0.39822166
H  1.51869787 -3.51389537 -1.59176433
C  1.52342275 -3.26576282 1.89737746
H  0.92139255 -4.15888103 2.08639278
H  2.57553084 -3.51244477 2.04769044
H  1.23338078 -2.48926026 2.61223309
C  -0.18116544 2.57319739 0.16163891
C  1.34134734 2.79163875 0.29435601
O  -0.97502728 3.53083924 0.25853853
C  1.77968214 3.79670486 -0.78648253
H  1.21943898 4.72800404 -0.66628876
H  2.84502225 4.01644492 -0.69168321
H  1.58549486 3.3964592 -1.78642901
C  1.59204221 3.34788335 1.71119399
H  2.64901625 3.58218523 1.84634961
H  1.00783341 4.26188561 1.84947685
H  1.28833461 2.61920299 2.46940889
C  3.30494737 -1.3925193 0.25015052
C  3.33273763 1.34833735 0.17274784
C  3.87549609 -0.04167283 -0.28238802
O  4.1292554 -2.26180036 0.60269017
O  4.17479056 2.21973259 0.47450812
F  5.22447434 -0.04927082 -0.0662645
F  3.72680806 -0.07949258 -1.67874137
Cl -5.77206661 -1.54650886 -0.10296022
Cl -5.73954885 1.6656333 -0.19148393
