program: Gaussian 09
title: 000032739
version: EM64L-G09RevD.01
frameworkgroup: C1[X(C5H12ClO2PS2)]
method: RPBEPBE
basis: SDD
operation: Freq
keyword: #p
keyword: freq=noraman
keyword: PBEPBE/SDD
title: #p freq=noraman PBEPBE/SDD
converged: YES YES NO NO
title: Mulliken charges:
elementType: Cl S S P O O C C C C C H H H H H H H H H H H H
charge: -0.041662 0.097684 -0.214104 0.612552 -0.458328 -0.470446 -0.220240 -0.219527 -0.652664 -0.648449 -0.739907 0.234193 0.232507 0.222058 0.238582 0.210683 0.244960 0.233165 0.213480 0.239957 0.229611 0.313012 0.342883
chargesum: 0.00000
title: Mulliken charges with hydrogens summed into heavy atoms:
elementType: Cl S S P O O C C C C C
charge: -0.041662 0.097684 -0.214104 0.612552 -0.458328 -0.470446 0.246460 0.241113 0.036144 0.034599 -0.084012
polarizability: 1.61048002e+02 1.41235212e+01 1.41363769e+02 -1.03561552e+01 -6.12233787e+00 1.11806705e+02
1716.lowfreq: -12.3918 -9.4620 -3.3601 -0.0020 -0.0017 0.0013 20.6821 34.1234 46.3972
frequency: 19.7441 33.6377 46.2729 54.2516 67.9434 79.1865 92.3591 113.4160 121.4137 172.3387 183.6041 236.0509 243.1441 255.9769 266.9880 282.2106 293.2106 324.7405 394.8240 433.2742 543.6973 596.8172 650.2479 673.8447 715.1705 810.5449 811.5313 833.2520 864.0413 889.2386 1012.5452 1024.0069 1103.0373 1108.9212 1132.7431 1136.1700 1139.6760 1232.4705 1254.9607 1259.6460 1352.1945 1356.6703 1394.9796 1395.6177 1398.5532 1456.6354 1457.5554 1472.9566 1475.5252 1485.3508 1487.3847 2986.4226 2990.3041 2997.8112 2998.0170 3052.3637 3057.4246 3070.6271 3093.9226 3094.3229 3112.8544 3115.8045 3171.4764
redmass: 2.9368 7.2658 2.4362 3.4375 14.6485 3.7989 1.9462 5.3240 5.9577 4.2585 4.3336 1.3789 1.9410 1.8868 5.2191 5.5013 5.1386 5.8599 7.5818 5.7097 11.8115 8.7419 8.3374 6.1801 7.8454 1.0909 1.0920 1.4072 4.8656 3.6077 2.3208 2.8432 2.2509 2.2198 1.4251 1.4248 1.0220 1.0896 1.1405 1.1358 1.2606 1.2508 1.2352 1.2371 1.0735 1.0400 1.0389 1.0635 1.0530 1.0665 1.0760 1.0553 1.0541 1.0374 1.0379 1.1080 1.1087 1.0535 1.0981 1.0978 1.1021 1.1023 1.1145
irintensity: 0.0629 0.5198 1.8943 0.4236 1.0728 1.5811 2.1354 3.4274 7.2311 2.2291 0.7432 0.5665 1.0651 1.7516 5.7160 3.1448 6.1008 6.0710 82.7544 0.8201 142.1960 42.7000 59.5595 62.0447 93.7066 2.1795 7.1798 10.5880 298.1663 26.6254 184.5417 10.4688 13.3744 2.6574 1.5656 8.6036 2.4112 25.4384 0.1535 0.1177 14.1921 4.5786 27.7396 28.9528 10.5987 11.7824 14.3273 6.1409 6.3340 9.0533 16.6179 25.8154 22.5994 33.2340 9.8663 9.4470 10.2552 4.0853 25.2431 21.1002 27.5336 22.0198 1.0917
temp: 298.150 k
press: 1.00000 atm
elementType: 17 16 16 15 8 8 6 6 6 6 6 1 1 1 1 1 1 1 1 1 1 1 1
symmnumber: 1
zpe: 448491.5 jmol-1
zpe.correction: 0.170821 hartree
zpe.thermalcorrener: 0.187164 hartree
zpe.thermalcorrenthalpy: 0.188108 hartree
zpe.thermalcorrgfe: 0.123500 hartree
zpe.sumelectzpe: -1944.671061 hartree
zpe.sumelectthermal: -1944.654718 hartree
zpe.sumelectthermalent: -1944.653774 hartree
zpe.sumelectthermalfe: -1944.718382 hartree
dipole: 1.0340 -1.6297 1.1657
dipole: 2.2548
quadrupole: -93.0631 -90.1637 -102.4939
quadrupole: -11.6852 2.1568 2.4472
quadrupole: 2.1771 5.0765 -7.2537 -11.6852 2.1568 2.4472
hfenergy: -1944.8418823 hartree
pointgroup: C01 [X(C5H12Cl1O2P1S2)]
dipole: 0.7035402 -0.0625966 -0.536693 debye
dipolederiv: -0.4324974 0.4137367 -0.290151 0.1413436 -0.4516502 0.1952461 -0.1167062 0.2418768 -0.3047325 -0.2695023 -0.1065361 0.0156772 0.034595 -0.8218406 0.1080643 -0.0949112 0.244577 -0.3622378 -0.4048726 -0.0360963 0.0435764 -0.013669 -0.6374406 0.2123483 0.0378107 0.2152329 -0.5287029 1.5861166 0.0572704 -0.106106 -0.0576258 2.0313158 -0.3162796 -0.0338585 0.0623113 1.3494689 -1.3945233 0.0212908 -0.2113542 0.1861484 -0.5681325 0.0789997 -0.2936251 -0.0454659 -0.5538932 -1.3442946 0.427306 0.2721324 0.3336626 -0.7102117 -0.0235096 0.2924154 -0.1810595 -0.5833374 1.034459 -0.0538723 0.2317832 -0.160681 0.2860836 -0.0313089 -0.2161911 0.0022172 0.1301747 0.9906294 -0.3124892 -0.2180423 -0.2948523 0.3989049 0.1316216 0.2114637 -0.0837519 0.1335997 -0.1407714 0.0134536 -0.1255456 0.0426434 0.0444222 0.0373182 -0.0273408 0.030657 -0.0133283 -0.1184818 0.0835522 0.1197428 0.0668119 0.0291986 -0.0584839 0.0201413 -0.0060395 -0.0017196 0.493603 -0.5562517 0.3417653 -0.2713037 0.4697364 -0.3379963 0.2699877 -0.6490112 0.4561187 -0.0435958 -0.0010641 -0.0177002 -0.0496652 -0.0245007 0.1002766 0.08189 0.0808779 -0.0001316 -0.0233141 -0.0235654 -0.0662818 0.0464996 -0.0464754 -0.089922 0.0257316 -0.074758 0.0017191 -0.0649357 0.0063528 -0.0047594 -0.0518876 -0.0446786 -0.1166654 -0.0965555 -0.0539694 -0.0103639 -0.015365 -0.0200361 0.068869 0.0371958 -0.0455245 0.0593767 -0.031466 0.107955 0.0157994 -0.1499508 0.0486048 0.0216459 0.0615336 0.1054194 -0.0071518 0.0330242 -0.015655 0.0555729 0.110408 -0.0676958 0.0741263 -0.0405825 -0.0075501 0.0945065 0.0246523 0.0679039 0.0315953 0.1259123 0.0176556 0.0162992 -0.021954 -0.0643715 -0.1159629 -0.0297735 -0.0786244 0.0233333 -0.1221584 0.1074506 -0.0163865 0.1027676 0.073563 0.0092542 -0.0303379 0.0106528 0.0551321 0.0683157 -0.1034056 -0.0821588 -0.0753114 0.0073773 -0.0774691 -0.0230311 -0.0797587 0.0180338 0.1213656 -0.0208709 -0.0006419 -0.0508151 -0.0616597 0.1179864 0.0439924 0.0676958 0.0187458 -0.0370553 0.0044149 -0.0408347 -0.014033 -0.0203006 0.0623573 -0.0297447 0.1095931 0.0552387 0.0305092 0.1007949 -0.0256554 0.0491791 0.0583157 -0.0326064 -0.0175676 0.0265429 0.0139148 unknown
polarizability: 136.1618602|-8.5653886|153.5691596|2.9501259|-25.7344432|124.4874564 unknown
InChI: InChI=1S/C4H10O2PS.CH2ClS/c1-3-5-7(8)6-4-2;2-1-3/h3-4H2,1-2H3;1H2
charge 0 multiplicity 1
23 atoms
Cl -1.059933 3.195937 -0.836574
S  0.430934 1.537624 1.388864
S  -0.337458 -1.944096 2.268348
P  -0.084346 -0.635285 0.700091
O  -1.322109 -0.413595 -0.479978
O  1.139204 -0.944492 -0.487688
C  -2.701407 -0.078188 -0.000387
C  2.439068 -1.516227 -0.020154
C  -3.545935 0.071121 -1.260231
C  3.224617 -1.849136 -1.284505
C  0.528453 2.321258 -0.295556
H  -3.057755 -0.898143 0.651488
H  -2.656949 0.865456 0.576071
H  2.958256 -0.762151 0.60271
H  2.237732 -2.415407 0.592122
H  -4.58839 0.309993 -0.97928
H  -3.156028 0.888125 -1.889454
H  -3.54631 -0.863461 -1.845944
H  4.206556 -2.275614 -1.007894
H  2.681311 -2.587559 -1.897125
H  3.396401 -0.945451 -1.893299
H  1.299525 3.101574 -0.257548
H  0.740863 1.561418 -1.059579
