program: Gaussian 09
title: 000032755
version: EM64L-G09RevD.01
frameworkgroup: C1[X(C16H16O)]
method: RPBEPBE
basis: SDD
operation: Freq
keyword: #pfreq=noraman
keyword: PBEPBE/SDD
title: #p freq=noraman PBEPBE/SDD
converged: YES YES NO NO
title: Mulliken charges:
elementType: O C C C C C C C C C C C C C C C C H H H H H H H H H H H H H H H H
charge: -0.233865 0.312296 0.327556 0.327458 -0.562406 0.297223 -0.000592 -0.382587 -0.427617 -0.813949 -0.808222 -0.368344 -0.362695 0.433662 -0.403875 -0.378103 -0.806486 0.274045 0.267242 0.233721 0.239229 0.224590 0.225761 0.230038 0.228028 0.230657 0.266344 0.269944 0.233070 0.232859 0.228722 0.226333 0.239965
chargesum: 0.00000
title: Mulliken charges with hydrogens summed into heavy atoms:
elementType: O C C C C C C C C C C C C C C C C
charge: -0.233865 0.312296 0.327556 0.327458 -0.288361 0.297223 -0.000592 -0.115345 -0.193897 -0.124369 -0.119499 -0.102000 -0.092751 0.433662 -0.170805 -0.145245 -0.111466
polarizability: 2.86026449e+02 4.87886515e-01 1.69299342e+02 8.93160096e+00 -3.46748150e+00 1.01261738e+02
1716.lowfreq: -16.4229 -11.3291 -3.5413 0.0004 0.0007 0.0007 4.7503 34.0984 52.1653
frequency: -16.0415 34.0755 52.1150 66.8215 98.5474 116.0336 141.2856 167.1836 182.8954 201.3768 226.4581 263.0686 291.0586 305.9417 344.3345 360.4915 404.1741 412.8388 439.3241 478.1660 508.1778 526.0258 577.4533 585.8775 633.1360 653.8401 691.1622 729.4388 735.3383 757.6972 782.1645 833.6377 839.7627 850.1219 862.0506 924.2758 959.7485 965.9779 977.3958 986.6851 991.2850 993.6110 1007.2557 1018.7712 1032.1005 1046.5030 1053.8783 1123.3290 1125.4021 1153.4723 1192.7515 1200.4165 1224.6116 1236.5489 1274.8007 1295.4706 1310.6635 1368.5869 1373.2254 1392.1432 1397.7778 1401.6514 1406.7284 1409.4277 1461.4408 1466.1962 1468.8705 1473.3676 1475.3303 1476.4502 1493.7643 1501.3054 1529.3161 1571.3376 1579.3964 1617.0585 1621.4315 2969.7624 2971.1837 2976.3248 3040.9106 3044.3626 3057.7679 3086.2070 3087.8891 3089.9236 3122.9648 3123.9510 3125.4296 3141.0062 3152.0094 3156.5151 3159.5241
redmass: 1.0236 3.9894 4.0757 3.6159 4.8339 1.0781 3.0137 1.2169 4.3289 2.7836 4.5605 4.1096 2.5682 3.9977 3.6097 4.7193 3.1115 3.0457 2.8214 2.9694 4.1347 4.5674 4.1565 5.5005 6.8116 5.4087 3.8200 3.1227 4.4572 2.3400 4.8537 2.0231 1.7066 1.9662 1.3706 1.4465 1.8257 1.6649 1.3162 1.3921 1.3860 1.6243 2.2049 2.1608 1.4760 1.5858 1.6631 1.8740 1.4926 1.7966 1.1865 2.1111 2.9529 2.4491 2.1173 1.8229 1.3587 4.9553 5.8184 1.2356 1.2256 1.6980 2.1014 3.0870 1.0479 1.1715 1.1024 1.0607 1.0458 1.2430 2.2328 2.6737 8.6540 6.0218 6.7978 6.2338 6.4585 1.0376 1.0384 1.0388 1.0967 1.0967 1.0947 1.0985 1.0999 1.0979 1.0883 1.0886 1.0889 1.0913 1.0954 1.0947 1.0958
irintensity: 0.7443 1.4673 0.8273 0.3257 1.6506 0.2318 0.1561 1.6873 0.9031 2.3252 0.4686 7.3095 0.2466 1.0055 3.0712 0.6911 0.8108 0.3828 6.3885 13.5624 3.3770 6.2638 1.6250 12.1485 0.5782 0.4674 13.0146 0.3203 1.1250 50.3308 11.7085 36.2380 17.4260 12.3699 12.1483 9.5373 29.2749 9.4344 1.0616 0.2336 7.8343 3.2187 0.5159 1.9421 17.3023 25.4164 0.3919 30.8704 3.4057 3.0099 45.4248 2.5002 2.5548 26.4941 188.5599 145.7740 35.4888 5.4044 5.1755 7.7925 14.1184 55.0844 0.6276 24.1625 0.5092 17.7608 15.6209 11.0121 31.5189 0.9019 4.2561 0.4097 159.5775 1.8777 27.0822 91.6545 8.2823 57.8657 16.0984 30.0026 40.4008 0.4020 21.1508 30.7153 16.7545 7.8763 7.9455 28.1696 18.8410 5.1843 11.8690 11.0062 3.9966
temp: 298.150 k
press: 1.00000 atm
elementType: 8 6 6 6 6 6 6 6 6 6 6 6 6 6 6 6 6 1 1 1 1 1 1 1 1 1 1 1 1 1 1 1 1
symmnumber: 1
zpe: 706021.4 jmol-1
zpe.correction: 0.268909 hartree
zpe.thermalcorrener: 0.284295 hartree
zpe.thermalcorrenthalpy: 0.285240 hartree
zpe.thermalcorrgfe: 0.225795 hartree
zpe.sumelectzpe: -693.339535 hartree
zpe.sumelectthermal: -693.324148 hartree
zpe.sumelectthermalent: -693.323204 hartree
zpe.sumelectthermalfe: -693.382649 hartree
dipole: 0.3027 -3.6968 0.4630
dipole: 3.7379
quadrupole: -72.3920 -103.3815 -101.8033
quadrupole: 0.9515 2.0735 0.0532
quadrupole: 20.1336 -10.8559 -9.2777 0.9515 2.0735 0.0532
hfenergy: -693.6084439 hartree
pointgroup: C01 [X(C16H16O1)]
dipole: -0.2081164 -1.117512 0.9330301 debye
polarizability: 284.396547|6.5606103|135.800061|17.3802261|-33.8795128|136.3909223 unknown
InChI: InChI=1S/C16H16O/c1-11-4-7-14(8-5-11)16(17)15-9-6-12(2)13(3)10-15/h4-10H,1-3H3
charge 0 multiplicity 1
33 atoms
O  0.367179 1.664622 -1.839331
C  -0.969667 0.215466 -0.463295
C  -3.382108 -0.109085 -0.916682
C  -3.556122 -0.640282 0.402063
C  -2.098882 0.316386 -1.31887
C  1.639715 0.198525 -0.423244
C  0.345833 0.74499 -0.957726
C  -1.151557 -0.304418 0.844527
C  -2.433491 -0.71778 1.262866
C  -4.559309 0.001071 -1.868882
C  -4.919841 -1.102647 0.878085
C  1.786796 -1.135854 0.041417
C  2.78823 1.03524 -0.458917
C  4.189618 -0.771583 0.453878
C  3.045435 -1.610092 0.468211
C  4.036156 0.561766 -0.016004
C  5.546228 -1.290576 0.893727
H  -1.947436 0.748261 -2.314585
H  -0.309007 -0.350429 1.541855
H  -2.569768 -1.103403 2.280296
H  -4.252458 0.442061 -2.831727
H  -5.009214 -0.989053 -2.077003
H  -5.365147 0.633243 -1.448435
H  -5.657995 -0.277724 0.855296
H  -5.324661 -1.904937 0.231375
H  -4.875313 -1.488551 1.910328
H  0.925953 -1.812402 0.03918
H  2.673629 2.054484 -0.842665
H  3.14327 -2.64683 0.81244
H  4.907624 1.22749 -0.03575
H  6.135352 -0.505927 1.400733
H  5.450456 -2.148283 1.581829
H  6.138902 -1.631152 0.022208
