program: Gaussian 09
title: Benchmark H H Intermediate PBE(0) D3 singlet
version: ES64L-G09RevD.01
frameworkgroup: C1[X(C19H40MoNNaO3P2)]
method: RM06
basis: GenECP
operation: Freq
keyword: #P
keyword: Geom=AllCheck
keyword: Guess=TCheck
keyword: SCRF=Check
keyword: GenChk
keyword: RM06/GenECP
keyword: Freq
converged: YES YES NO YES
title: Mulliken charges:
elementType: C H H C H H C H H C H H C H C H H H C H H H C H C H H H C H H H C H C H H H C H H H C H C H H H C H H H C C Mo N O O P P H H O C H Na H
charge: -0.373733 0.166103 0.188639 0.177631 0.116181 0.123243 0.145534 0.127919 0.108953 -0.359310 0.181210 0.166012 -0.314390 0.169786 -0.127566 0.146423 0.167186 0.147670 -0.178651 0.161939 0.152303 0.157730 -0.347275 0.156040 -0.211977 0.148066 0.147885 0.178948 -0.234922 0.176452 0.143447 0.146707 -0.148322 0.168189 -0.197047 0.160532 0.154937 0.159821 -0.124086 0.124569 0.164170 0.159893 -0.122101 0.158335 -0.249568 0.147704 0.147910 0.184506 -0.325118 0.144136 0.135662 0.165423 -0.542277 -0.534730 1.505800 -1.048825 -0.317351 -0.330471 -1.007550 -1.282101 0.511092 0.117038 -0.509998 -0.058100 0.125479 0.699000 0.109266
chargesum: 0.00000
title: Mulliken charges with hydrogens summed into heavy atoms:
elementType: C C C C C C C C C C C C C C C C C C Mo N O O P P O C Na
charge: -0.018991 0.417055 0.382406 -0.012088 -0.144604 0.333713 0.293322 -0.191235 0.262923 0.231683 0.019867 0.278242 0.324545 0.036233 0.230552 0.120104 -0.542277 -0.534730 1.505800 -1.048825 -0.317351 -0.330471 -1.007550 -1.282101 0.001094 0.293684 0.699000
polarizability: 4.72996145e+02 -5.37310837e-01 4.05617279e+02 -3.16096561e-01 -1.05256396e+01 3.99973003e+02
1716.lowfreq: -12.8036 -0.0014 -0.0014 -0.0008 4.0492 13.1718 29.0653 39.8132 49.0086
frequency: 28.0732 39.5402 48.7787 61.4326 66.7567 72.0476 78.4251 80.9074 83.3806 86.3795 92.0745 95.5563 103.9503 109.4973 120.7770 130.6695 136.7538 145.6402 147.9362 152.8163 169.8902 175.8786 185.9338 191.1888 197.6529 207.0177 217.2078 219.2817 228.8806 229.9500 238.1446 242.6204 246.9059 248.5659 249.2506 251.0298 257.7087 269.7950 273.1385 281.0805 292.4653 296.6040 306.0186 312.9991 343.9211 357.1635 361.5012 367.1385 374.6085 386.5095 408.6088 429.1890 443.5102 466.3341 475.6733 498.1211 513.9476 528.7307 539.6808 548.8253 567.2901 603.8216 623.3063 628.4243 644.2368 647.9194 672.4415 692.4450 703.2591 782.0831 813.1710 845.9582 904.9598 905.1493 909.1158 909.8546 911.6411 918.5502 919.6639 926.9466 959.3663 962.8915 966.6327 967.1604 970.4234 977.5739 980.7765 1012.4647 1018.3045 1023.2319 1045.0231 1049.3701 1085.8849 1094.8734 1118.1132 1123.5894 1127.3399 1135.7907 1145.1035 1154.5361 1171.3464 1171.8177 1176.2818 1177.7928 1180.5708 1185.1881 1196.0471 1200.8990 1226.9412 1243.7404 1246.1731 1262.3941 1268.1085 1287.0086 1295.3520 1311.4958 1316.4867 1318.3995 1324.3820 1340.2042 1371.6953 1373.3318 1377.3643 1377.5399 1382.1298 1387.4537 1388.4194 1393.7877 1394.2547 1415.5868 1419.0887 1433.5296 1439.0023 1442.8011 1444.6266 1447.2175 1447.6249 1450.0151 1450.6748 1456.0556 1456.7150 1462.0519 1462.6899 1464.1278 1465.8800 1470.3596 1472.4116 1474.1268 1478.2168 1478.4488 1481.2591 1484.4171 1501.3769 1696.1311 1785.6361 2907.3251 2911.7508 2930.0673 2932.5332 2941.1760 2998.4167 3004.2734 3006.8081 3008.2932 3011.4680 3012.7274 3013.1502 3014.7347 3014.9729 3020.4529 3021.5351 3022.6889 3024.7067 3026.5394 3031.4507 3052.3856 3085.0763 3085.7304 3086.5289 3091.1127 3092.4720 3092.5721 3092.6610 3093.5403 3094.2179 3098.5787 3103.4645 3108.5478 3109.8767 3114.3091 3114.6769 3118.1101 3123.6148 3128.1798 3307.9392
redmass: 4.7032 3.8498 4.7182 4.1018 5.0111 3.3136 4.0614 5.7701 7.6503 3.6060 4.0035 4.3675 3.7178 4.8404 3.1894 4.1189 3.6909 3.6593 3.5900 2.8529 1.8443 1.1896 1.7058 2.6500 2.7175 2.8838 2.9629 4.9683 1.7743 3.4997 1.5472 1.9229 3.0624 1.7695 7.8232 1.9456 1.5731 1.1044 1.2547 1.3645 2.1312 1.6529 1.6055 2.7264 2.7010 3.1132 2.4676 2.8312 2.9111 2.5542 3.1014 2.5167 2.8929 2.6460 2.6279 11.4939 3.4742 3.3180 11.6996 11.2967 14.6103 5.0355 3.6380 3.3948 3.9226 3.2396 11.1090 3.4147 3.8680 1.8229 1.6628 1.1569 2.1665 1.9665 1.7198 2.0669 1.1912 1.3168 1.2400 1.1816 1.3254 1.3299 1.3403 1.3253 1.8283 1.5529 1.5575 1.4200 1.2483 1.3416 1.3492 1.3728 7.1889 4.2019 2.3713 2.3617 2.3681 2.4661 1.2809 2.2811 1.8235 1.5356 1.8952 1.7918 1.8705 1.2640 1.5074 1.3185 1.7259 1.4964 1.4868 1.3547 1.3347 1.2293 1.2130 1.3533 1.3416 1.3472 1.3199 1.3468 1.2977 1.3125 1.2890 1.2910 1.4150 1.2361 1.2361 1.2364 1.2397 1.1026 1.1040 1.0468 1.0458 1.0399 1.0446 1.0427 1.0459 1.0482 1.0485 1.0490 1.0471 1.0452 1.0582 1.0507 1.0574 1.0773 1.0757 1.0556 1.1354 1.0528 1.0547 1.0508 1.0712 13.0072 13.0182 1.0578 1.0568 1.0640 1.0719 1.1035 1.0970 1.0831 1.0404 1.0678 1.0513 1.0377 1.0380 1.0386 1.0389 1.0412 1.0803 1.0402 1.0795 1.0617 1.0608 1.0977 1.1019 1.1020 1.1021 1.1025 1.1029 1.1013 1.1008 1.1026 1.1015 1.1010 1.1023 1.1020 1.1013 1.0999 1.1000 1.0997 1.1003 1.1009 1.0711
irintensity: 0.0599 0.3229 3.4219 0.2759 4.8786 7.5235 1.0948 3.5136 7.6687 2.9618 11.1916 3.8959 5.4794 1.4174 1.1754 3.2769 3.3622 0.3650 1.3228 2.6949 1.4729 0.6298 0.8835 0.9134 0.8520 1.5070 0.3318 10.6670 1.0072 0.0741 1.9236 0.3423 2.8178 7.6952 71.1567 4.4246 0.1856 0.2240 0.9119 2.9513 0.3697 1.0793 1.6820 8.8461 0.1472 21.0165 0.9529 3.3974 19.1780 5.6848 12.9408 8.1297 25.5317 36.1074 14.3183 1.1703 4.3155 4.4698 0.0580 0.6594 3.1083 19.2242 21.6917 127.5181 9.5836 23.6342 1.8994 10.4327 42.5859 6.4491 116.7743 12.1392 7.4900 4.5573 3.6967 6.0517 4.3593 11.1696 5.5511 1.4162 0.9291 3.0453 4.1636 4.2706 8.1473 34.6152 7.5405 3.0359 3.5556 19.0670 58.3150 6.8057 94.9444 49.9662 4.6414 5.2585 6.3830 6.6555 14.5568 60.0612 3.5282 0.0244 0.2632 9.3680 1.2925 0.4847 19.6677 10.5602 34.9009 56.8401 1.7514 1.7883 3.1143 1.5122 2.8393 0.4599 0.9512 0.6438 0.5533 47.3597 2.8467 5.3324 21.5021 7.1917 2.2978 4.5013 23.0829 8.7044 8.9306 10.7269 8.7531 0.6186 5.4882 5.4173 0.8450 1.5260 16.2742 3.8205 1.1716 17.9041 2.1800 19.6421 6.4282 9.7711 10.3144 15.6638 4.0716 7.4587 8.1427 8.0387 5.4353 11.5148 28.3467 1285.7097 1449.7985 22.2896 470.4930 118.7719 72.1295 6.7631 115.7246 8.3704 43.5158 11.4096 9.7128 31.2311 38.4877 59.1042 34.7930 129.9309 32.6871 84.4713 24.6076 40.1680 37.8963 83.0138 31.7474 25.4067 51.9348 16.6647 12.2254 63.0395 23.4451 6.8896 88.5944 36.9923 27.3922 25.0874 24.3476 6.9971 10.1813 20.5547 19.6019 18.9336 983.8168
temp: 373.150 k
press: 50.00000 atm
elementType: 6 1 1 6 1 1 6 1 1 6 1 1 6 1 6 1 1 1 6 1 1 1 6 1 6 1 1 1 6 1 1 1 6 1 6 1 1 1 6 1 1 1 6 1 6 1 1 1 6 1 1 1 6 6 42 7 8 8 15 15 1 1 8 6 1 11 1
symmnumber: 1
zpe: 1489578.6 jmol-1
zpe.correction: 0.567351 hartree
zpe.thermalcorrener: 0.622592 hartree
zpe.thermalcorrenthalpy: 0.623774 hartree
zpe.thermalcorrgfe: 0.476808 hartree
zpe.sumelectzpe: -1939.875015 hartree
zpe.sumelectthermal: -1939.819773 hartree
zpe.sumelectthermalent: -1939.818591 hartree
zpe.sumelectthermalfe: -1939.965557 hartree
dipole: 4.9789 6.0230 -0.4579
dipole: 7.8279
quadrupole: -175.7469 -201.1729 -208.2975
quadrupole: 11.0306 -6.1446 -11.9293
quadrupole: 19.3255 -6.1005 -13.2251 11.0306 -6.1446 -11.9293
hfenergy: -1940.4423654 hartree
pointgroup: C01 [X(C19H40Mo1N1Na1O3P2)]
dipole: -0.8678591 1.8894949 2.2718728 debye
polarizability: 435.4753207|-39.8202513|430.7409535|-3.8530726|-3.5231157|412.370153 unknown
InChI: InChI=1S/C16H36NP2.CH4O.2CO.Mo.Na/c1-13(2)18(14(3)4)11-9-17-10-12-19(15(5)6)16(7)8;3*1-2;;/h13-16H,9-12H2,1-8H3;2H,1H3;;;;/q-1;;2*-1;+1;+2
charge 0 multiplicity 1
67 atoms
C  2.71447113 -1.28793211 -2.16959098
H  3.75419149 -1.45132421 -2.48745276
H  2.1264677 -2.14510087 -2.52702378
C  2.14684672 -0.0087843 -2.76951408
H  2.9116341 0.79474814 -2.7552519
H  1.93716041 -0.1969253 -3.84290618
C  0.3013308 1.46433739 -2.91073709
H  0.15484356 1.09097917 -3.94573155
H  0.96847236 2.34461736 -3.01114425
C  -1.05551362 1.89252956 -2.36879901
H  -1.80295086 1.12370684 -2.61651069
H  -1.39203813 2.8318677 -2.83096593
C  2.34328569 -3.11609939 0.02047793
H  1.5439241 -3.37627012 -0.69394893
C  1.81272813 -3.40597841 1.41853722
H  1.63337276 -4.48365818 1.53712938
H  0.86793434 -2.88362364 1.60752097
H  2.51881024 -3.10516572 2.2034078
C  3.5716122 -3.95756756 -0.30245085
H  4.38428267 -3.77722709 0.41453428
H  3.96184147 -3.76745371 -1.31058136
H  3.32457683 -5.02661457 -0.24451903
C  4.28644967 -0.86501346 0.25071653
H  4.96089437 -1.6019629 -0.21420033
C  4.41255959 -0.95013682 1.76641715
H  5.39552941 -0.57990272 2.08898441
H  4.31156319 -1.97612898 2.14002538
H  3.64787106 -0.3349176 2.26062588
C  4.66869712 0.52486462 -0.24670116
H  3.97271565 1.28686889 0.13211309
H  4.67394493 0.59248372 -1.34165113
H  5.67640257 0.78759265 0.10316359
C  -2.84889808 1.72429428 -0.12329176
H  -3.05565239 0.8136334 -0.70962486
C  -3.78173595 2.82927691 -0.60171782
H  -4.82906531 2.5125029 -0.50172537
H  -3.62060204 3.0918532 -1.65476463
H  -3.66594243 3.7444375 -0.00474068
C  -3.10443347 1.37387327 1.33803652
H  -2.91415866 2.22770436 2.00558865
H  -2.49062258 0.52416559 1.66107241
H  -4.15698486 1.09458592 1.48321881
C  -0.73262792 3.8169019 -0.19905251
H  -1.55015041 4.36612446 -0.69281216
C  0.59215889 4.24870918 -0.81919586
H  0.81630495 5.28898596 -0.54582622
H  0.57796976 4.19473491 -1.91369086
H  1.42200299 3.62174942 -0.46026309
C  -0.73903551 4.14534991 1.28989615
H  0.11163478 3.65808773 1.78842804
H  -1.67337777 3.85813904 1.78919302
H  -0.61410208 5.2261998 1.44182904
C  1.52363447 1.34887472 1.42504812
C  -0.07039099 -0.4253111 1.65689719
Mo 0.70085842 0.32323933 0.07028572
N  0.93150337 0.4350793 -2.09206613
O  1.93064698 1.98538939 2.37530143
O  -0.52858771 -0.76265085 2.72664641
P  2.55611135 -1.28451366 -0.31714054
P  -1.03146252 1.99551838 -0.51370104
H  -0.13530051 -0.97745831 -2.54833737
H  -1.00894467 -1.61307399 -0.70904487
O  -0.7094712 -1.75466502 -2.77271649
C  -1.44606059 -2.06469946 -1.62515205
H  -1.46836703 -3.15290419 -1.46893041
Na -0.1091695 1.43950751 3.44829514
H  -2.49250094 -1.72081467 -1.697724
