program: Gaussian 09
title: Benchmark H H Intermediate PBE(0) D3 singlet
version: EM64L-G09RevD.01
frameworkgroup: C1[X(C31H58BMoN2NaO3P2)]
method: RM06
basis: GenECP
operation: Freq
keyword: #P
keyword: Geom=AllCheck
keyword: Guess=TCheck
keyword: SCRF=Check
keyword: GenChk
keyword: RM06/GenECP
keyword: Freq
converged: YES YES NO YES
title: Mulliken charges:
elementType: B C C C C C C C C C C C C C C C C C C C C C C C C C C C C C C C Mo N N O O O P P H H H H H H H H H H H H H H H H H H H H H H H H H H H H H H H H H H H H H H H H H H H H H H H H H H H H H H H H H H Na
charge: 0.664042 -0.280929 0.199371 0.162709 -0.272829 -0.682879 0.005615 0.055901 -0.133136 -0.261991 -0.188280 -0.819647 0.010492 0.051017 -0.118305 -0.225694 -0.178234 -0.574924 -1.078398 -0.211422 0.195314 0.052212 -0.199514 -0.121260 -0.205143 0.030959 -0.335646 -0.376399 -0.335387 -0.790354 -0.332635 -0.383337 0.943809 -0.733751 -0.867141 -0.249631 -0.269357 -0.093608 -0.964329 -0.768231 0.197418 0.176720 0.145705 0.166952 0.146364 0.169254 0.176262 0.194489 0.186426 0.157081 0.169427 0.158699 0.186358 0.162171 0.136059 0.158792 0.148877 0.175223 0.151390 0.154545 0.136681 0.152093 0.179338 0.142715 0.164020 0.185997 0.156142 0.170304 0.157782 0.155758 0.148254 0.151774 0.180505 0.152880 0.155099 0.136862 0.107012 0.106734 0.120969 0.121632 0.138434 0.114116 0.113765 0.137343 0.137505 0.127307 0.107315 0.105570 0.121194 0.118541 0.138844 0.131663 0.129456 0.151882 0.152414 0.151624 0.408624 0.124529 0.770060
chargesum: 0.00000
title: Mulliken charges with hydrogens summed into heavy atoms:
elementType: B C C C C C C C C C C C C C C C C C C C C C C C C C C C C C C C Mo N N O O O P P Na
charge: 0.664042 0.093209 0.512028 0.478328 0.097922 -0.496453 0.490822 0.540488 0.025656 0.213500 0.255039 -0.640309 0.503224 0.535244 0.037454 0.254839 0.266606 -0.574924 -1.078398 -0.086893 0.195314 0.181668 -0.047631 0.031153 -0.053519 0.162622 -0.121900 0.004636 -0.107506 -0.388199 -0.119750 -0.004757 0.943809 -0.325127 -0.867141 -0.249631 -0.269357 -0.093608 -0.964329 -0.768231 0.770060
chargesum: -0.00002
polarizability: 6.11683786e+02 9.00070178e-01 6.23898872e+02 2.67605049e-01 9.67531831e-01 5.80688576e+02
1716.lowfreq: -0.0130 -0.0026 -0.0024 2.7579 8.4563 12.3430 24.0904 24.7110 30.3722
redmass: 5.3087 5.3297 2.9698 4.4027 3.7006 4.3528 4.3333 4.3953 4.9376 3.0666 5.1202 4.5049 4.9095 5.3653 3.9071 3.8795 3.6383 8.4091 2.8896 3.6273 3.6455 3.0370 3.8202 3.6927 2.7484 3.3611 2.9272 3.2284 3.0956 2.7488 3.0835 4.6614 2.6507 2.0746 1.8598 1.3995 1.2241 6.1979 3.6436 3.5985 1.3223 1.1662 6.3437 3.2390 1.3933 2.0219 4.4809 1.4593 1.2622 1.3222 1.7518 1.7926 2.1681 3.3609 1.9084 1.3981 2.1723 1.9577 2.5630 1.8729 2.1835 1.6935 3.3774 2.5279 2.4247 3.2495 2.9274 3.1854 2.4710 3.0830 2.9035 2.9697 2.5038 2.5261 2.4268 2.5758 2.6450 3.2386 2.7401 2.7626 12.8344 4.3865 9.9087 5.4097 4.0681 12.3652 8.5464 4.9027 5.2280 3.7109 6.0330 3.4174 2.9635 2.2862 1.3563 3.7856 3.9869 12.1005 2.2238 1.8938 1.3257 1.8215 2.2959 2.1631 1.8402 1.2422 1.7337 1.5250 1.6348 1.6475 1.6724 2.1823 1.5209 1.3933 1.1678 1.3256 1.3984 1.2608 1.3954 1.3189 1.2027 1.3310 1.3561 1.3356 1.3245 1.3108 1.4764 1.3505 1.8947 2.2241 1.4552 1.9277 1.6040 3.9864 1.2641 2.5856 1.2797 1.1685 1.3697 2.0080 1.6281 2.0302 2.5498 2.2544 3.7443 1.4070 2.5104 2.0191 2.0931 2.0717 2.1387 2.3609 1.0740 1.8728 1.1136 1.9080 1.9063 1.9503 1.9406 1.4564 3.0736 1.7016 1.2589 1.5131 1.4943 1.2865 1.4503 1.3816 1.3908 1.5938 1.3935 1.5802 1.6058 1.2300 1.2243 1.3878 1.3793 1.3855 1.3707 1.3309 1.3258 5.6165 1.2834 1.2563 1.2923 1.2802 1.2447 1.2845 1.2973 1.4019 1.2300 1.2390 1.2331 1.2346 1.2390 1.1047 1.1275 3.7503 1.0953 1.0458 1.0488 1.0454 1.0780 1.0992 1.0424 1.0498 1.0765 1.0489 1.0541 1.0743 1.0487 1.0562 1.0548 1.0558 1.0482 1.0462 1.0548 1.0484 1.0420 1.0520 1.0512 1.2146 1.8184 1.0737 1.0727 1.0535 1.2051 2.7478 6.6508 7.3920 7.3442 12.9528 13.0753 1.0594 1.0607 1.0596 1.0665 1.0668 1.0434 1.0408 1.0948 1.0377 1.0517 1.0812 1.0409 1.0386 1.0407 1.0965 1.0381 1.0387 1.0436 1.0396 1.0772 1.0716 1.0695 1.0698 1.0773 1.0849 1.0947 1.0994 1.0960 1.0956 1.0999 1.1004 1.1002 1.0880 1.1009 1.1011 1.1016 1.1005 1.1014 1.1006 1.1009 1.1010 1.1003 1.1014 1.1010 1.1026 1.1018 1.1016 1.1021 1.1019 1.1024 1.0991 1.0987 1.0871 1.0882 1.0908 1.0951 1.0991 1.0757
irintensity: 0.2275 0.0675 1.7330 4.1853 0.0690 4.8830 0.5807 1.5761 12.2023 4.0105 4.4511 3.8481 1.5190 2.1482 3.3521 1.9210 3.3695 4.4175 1.1540 4.5463 1.7087 0.4904 1.8838 7.9394 0.1052 0.4942 1.2194 0.9696 1.0745 0.1911 0.8172 1.0469 6.6345 0.7213 0.1939 0.5773 0.3573 0.3465 2.2183 1.1727 0.4878 0.3994 6.4872 3.5142 2.6249 7.0219 55.6334 6.1036 1.6923 0.6552 2.8319 3.5669 0.5847 2.1196 1.7462 0.2412 1.5974 1.7464 1.2246 1.2137 2.8638 2.0526 0.0617 4.0478 1.5191 8.7724 2.8478 8.7089 0.9256 10.8414 1.5076 0.1516 4.3633 6.6181 6.0173 22.4417 7.1850 1.8757 0.2623 12.0539 0.0926 6.0579 0.1100 35.1439 8.3115 7.6918 1.2862 17.3704 94.3687 40.7537 1.4547 13.9839 25.3571 14.8593 0.1959 25.0353 54.8128 1.3020 34.5742 104.9803 0.5009 14.0328 69.2334 53.3428 79.4492 0.3588 21.1208 21.4190 6.1849 7.3764 6.3807 13.2674 12.0891 3.5793 3.6954 4.3907 1.2662 7.4385 20.9266 55.5760 0.2058 1.9481 0.5374 4.2329 1.3167 0.6111 0.8239 0.1161 0.0619 1.2060 0.0370 3.8284 0.8074 7.5224 4.6993 74.9177 16.9523 8.9855 57.7131 13.2215 12.7697 8.9785 75.4316 42.6515 15.2596 7.4194 11.2196 4.1784 6.0392 2.7883 12.8856 9.3086 0.5661 19.1207 2.2296 3.5816 3.2717 0.9802 0.8024 21.1293 36.3538 16.8085 0.5666 41.8677 6.3469 6.1336 2.8705 2.1274 0.8528 3.5070 20.6550 24.0886 26.9105 0.2229 3.7499 0.2004 3.2057 1.3130 1.2851 0.9392 7.5022 3.3415 117.5029 12.7806 0.4756 1.6975 9.4685 18.0293 8.7431 7.8243 0.9218 14.4648 21.4672 11.5240 6.9450 7.0205 5.3826 30.2714 8.5005 2.2369 1.0626 1.9752 10.6276 6.1302 0.9661 5.0625 3.3691 0.1718 5.2939 9.5504 9.1857 6.1582 21.5042 2.2387 5.8657 13.4043 8.5277 5.4308 0.7659 19.5587 9.1345 7.2422 11.3395 20.8426 17.9400 15.7756 11.3760 74.2071 5.5522 850.7783 837.3962 1189.0990 1345.8058 94.8291 18.7363 140.4080 4.9258 193.0530 56.6303 35.9711 71.5368 94.7254 12.7338 36.9691 35.2851 41.9800 49.0729 131.4956 45.5556 53.2064 60.4523 62.2971 34.2386 48.9207 9.8117 1.1877 6.3451 48.2438 65.4401 148.5424 25.6026 23.3263 38.8571 12.5422 121.6771 31.4830 57.2996 19.5323 0.2871 54.1031 8.1152 45.1332 102.6386 8.3150 30.1202 34.6703 19.7485 38.9388 30.5248 30.6645 22.9829 20.6373 21.4088 8.3052 26.3272 4.1753 0.4407 3.3996 24.8899 24.1167 67.3728
temp: 373.150 k
press: 50.00000 atm
elementType: 5 6 6 6 6 6 6 6 6 6 6 6 6 6 6 6 6 6 6 6 6 6 6 6 6 6 6 6 6 6 6 6 42 7 7 8 8 8 15 15 1 1 1 1 1 1 1 1 1 1 1 1 1 1 1 1 1 1 1 1 1 1 1 1 1 1 1 1 1 1 1 1 1 1 1 1 1 1 1 1 1 1 1 1 1 1 1 1 1 1 1 1 1 1 1 1 1 1 11
symmnumber: 1
zpe: 2219920.5 jmol-1
zpe.correction: 0.845523 hartree
zpe.thermalcorrener: 0.924036 hartree
zpe.thermalcorrenthalpy: 0.925218 hartree
zpe.thermalcorrgfe: 0.728155 hartree
zpe.sumelectzpe: -2487.036180 hartree
zpe.sumelectthermal: -2486.957667 hartree
zpe.sumelectthermalent: -2486.956485 hartree
zpe.sumelectthermalfe: -2487.153548 hartree
dipole: -16.0968 0.4051 2.7953
dipole: 16.3427
quadrupole: -312.5069 -268.0889 -274.3738
quadrupole: 0.5166 39.0564 -0.8559
quadrupole: -27.5170 16.9009 10.6161 0.5166 39.0564 -0.8559
hfenergy: -2487.881703 hartree
pointgroup: C01 [X(C31H58B1Mo1N2Na1O3P2)]
dipole: -6.401443 -0.1901629 0.5714664 debye
polarizability: 611.3859644|0.03777|623.6471856|2.7251636|3.77749|581.2380846 unknown
InChI: InChI=1S/C16H37NP2.C13H21BNO.2CO.Mo.Na/c1-13(2)18(14(3)4)11-9-17-10-12-19(15(5)6)16(7)8;1-4-14(5-2,6-3)15(12-16)13-10-8-7-9-11-13;2*1-2;;/h13-17H,9-12H2,1-8H3;7-12H,4-6H2,1-3H3;;;;/q;3*-1;+1;+2
charge 0 multiplicity 1
99 atoms
B  4.28935114 0.19026453 -0.79360375
C  -1.31026123 2.30458374 2.0478501
C  -1.88380959 1.02868432 2.64846229
C  -1.77013455 -1.42685012 2.5401428
C  -1.08866524 -2.58569968 1.82616667
C  0.05984533 3.2292343 -0.30760589
C  0.24325754 4.62166537 0.27951023
C  0.30109734 3.22515394 -1.81321953
C  -2.90185964 3.58002551 -0.06324564
C  -4.13639083 3.18331458 0.73773057
C  -3.24256277 3.69179163 -1.54403187
C  0.34143194 -3.19025575 -0.59073393
C  0.52412753 -3.13697822 -2.10288597
C  0.67000066 -4.57553387 -0.04982817
C  -2.57909981 -3.77636037 -0.44224576
C  -3.79149927 -3.67391249 0.47585365
C  -3.01605963 -3.62551775 -1.89591096
C  -1.81026062 -0.00564087 -2.30396052
C  -3.56424053 -0.14852276 -0.53518179
C  1.65324573 0.09590764 -0.63396362
C  2.73812693 0.12999285 1.39904787
C  2.6503087 1.32666907 2.11356714
C  2.49510904 1.31159766 3.49833654
C  2.42494071 0.10056775 4.18524679
C  2.52519271 -1.09606241 3.47666109
C  2.68103381 -1.08151975 2.09228871
C  5.10503547 -1.13979798 -0.3069085
C  4.51919644 -2.47310367 -0.76650863
C  4.01787178 0.19624523 -2.40495746
C  5.30834135 0.24123007 -3.22143538
C  5.03662279 1.55194779 -0.28666496
C  4.38520146 2.86396844 -0.71816087
Mo -1.67302751 -0.05927227 -0.39961513
N  -1.35833828 -0.14841464 1.94114878
N  2.82560659 0.14254652 -0.02857226
O  -2.07166605 0.00816469 -3.48423815
O  -4.74725984 -0.19200334 -0.81117755
O  0.55161848 0.04762378 -0.02520721
P  -1.51949474 2.35192907 0.18657526
P  -1.29936343 -2.48067182 -0.03186956
H  -0.22741112 2.33500108 2.24548664
H  -1.74475716 3.1893238 2.53266799
H  -1.63503871 0.97498952 3.7232364
H  -2.97976068 1.00363251 2.56069992
H  -1.51610099 -1.44757621 3.61497906
H  -2.86461302 -1.49376373 2.45880507
H  -1.43086407 -3.54742498 2.23078185
H  -0.0057632 -2.52963351 2.01780268
H  0.80768016 2.55826764 0.14579302
H  0.10514298 4.64807467 1.36843548
H  1.25948818 4.98622766 0.07146503
H  -0.45253767 5.34597686 -0.16698433
H  0.06650177 2.25398006 -2.26840002
H  1.35536395 3.45311162 -2.02660582
H  -0.30033377 3.98892212 -2.32423329
H  -2.53907502 4.55367989 0.30335873
H  -3.9515736 3.16050814 1.81854773
H  -4.50561007 2.19355471 0.43683251
H  -4.94436371 3.90701574 0.56344289
H  -4.08340662 4.38196141 -1.69649044
H  -3.53419074 2.7082262 -1.94292762
H  -2.40224066 4.05010082 -2.14946917
H  1.0427332 -2.46521664 -0.14479281
H  -0.04104412 -3.93574813 -2.60315924
H  1.58260542 -3.28514474 -2.35952034
H  0.20493866 -2.17731913 -2.53032771
H  0.02031118 -5.34553087 -0.48846964
H  1.70309631 -4.84591507 -0.31069883
H  0.58269141 -4.64203831 1.04225494
H  -2.10524076 -4.76109124 -0.30119773
H  -3.5497265 -3.8776025 1.52571105
H  -4.55410312 -4.40392488 0.17171886
H  -4.24864598 -2.67679203 0.41557811
H  -2.18075271 -3.64256231 -2.60543829
H  -3.71257472 -4.4284077 -2.17311929
H  -3.53837026 -2.66669427 -2.02465769
H  5.19693369 -1.14327704 0.79435353
H  6.14670177 -1.06559828 -0.66568103
H  4.99027444 -3.34634218 -0.29020925
H  3.43848822 -2.5318129 -0.55226466
H  4.62261621 -2.60921941 -1.85300796
H  3.44504498 -0.69499112 -2.72282924
H  3.39273504 1.05774783 -2.70573979
H  5.90917585 1.13049923 -2.98219599
H  5.94691119 -0.63075361 -3.01914977
H  5.12582203 0.2597455 -4.30587751
H  5.13651785 1.54045698 0.81376522
H  6.07822187 1.53569178 -0.65264622
H  4.83702421 3.75139721 -0.24979309
H  3.31001298 2.88128507 -0.47046818
H  4.45014063 3.01106461 -1.8061595
H  2.75463359 -2.01575012 1.53489716
H  2.69777285 2.27287569 1.57419144
H  2.42906673 2.25260793 4.04174589
H  2.30586706 0.08915893 5.26666146
H  2.48331914 -2.04830839 4.00279899
H  -0.33244617 -0.10161823 1.956738
H  1.67316459 0.10235554 -1.73285519
Na -4.3564564 -0.01470402 -3.08363647
