program: Gaussian 09
title: 000032773
version: EM64L-G09RevD.01
frameworkgroup: C1[X(C17H27ClN2O)]
method: RPBEPBE
basis: SDD
operation: Freq
keyword: #p
keyword: freq=noraman
keyword: PBEPBE/SDD
title: #p freq=noraman PBEPBE/SDD
converged: YES YES NO NO
title: Mulliken charges:
elementType: Cl O N N C C C C C C C C C C C C C C C C C H H H H H H H H H H H H H H H H H H H H H H H H H H H
charge: -0.096592 -0.219207 -0.072737 -0.475444 -0.431447 -0.331035 -0.359920 -0.335658 -0.349740 -0.474801 -0.630036 0.183994 -0.589827 0.161854 0.339887 0.370075 -0.422247 -0.416663 -0.835335 -0.828087 -0.231536 0.201008 0.199708 0.179671 0.235751 0.219988 0.186909 0.177652 0.210325 0.234399 0.205047 0.237625 0.173685 0.226862 0.186027 0.237150 0.264732 0.253256 0.298992 0.232717 0.232875 0.221590 0.243891 0.237485 0.290010 0.212293 0.218804 0.226051
chargesum: 0.00000
title: Mulliken charges with hydrogens summed into heavy atoms:
elementType: Cl O N N C C C C C C C C C C C C C C C C C
charge: -0.096592 -0.219207 -0.072737 -0.176451 -0.030731 0.084387 0.046976 0.052319 0.089706 -0.063491 0.020003 0.183994 -0.071838 0.161854 0.339887 0.370075 -0.189530 -0.183788 -0.132369 -0.106981 -0.005485
polarizability: 2.69081874e+02 1.81477187e+01 2.22719018e+02 6.69446248e+00 -9.36133951e+00 1.44549688e+02
1716.lowfreq: -6.4854 -0.0014 -0.0012 0.0008 1.8945 4.4436 6.6393 10.5229 16.4401
frequency: 3.0753 6.8315 15.7346 34.4860 51.2072 60.0747 72.2900 87.8387 91.9757 100.8874 114.3564 139.5974 161.7492 169.6911 179.5727 197.9563 210.8142 227.2822 237.5799 243.4554 276.3396 295.1071 299.3353 322.9079 324.4934 339.3623 368.5994 395.6303 447.7524 465.7455 508.9131 516.8379 518.3259 534.0670 553.7072 589.4462 591.7063 602.3569 675.5130 715.1397 725.9236 755.5713 769.1118 779.3102 798.1840 833.0976 846.6073 867.8559 899.2920 906.4441 916.9092 943.3847 964.8927 976.1653 981.7998 987.6565 1016.4287 1039.9446 1041.6445 1045.6112 1053.2162 1056.7082 1068.0052 1081.3969 1096.0496 1099.9756 1111.2973 1114.6938 1148.9930 1167.0976 1177.7598 1180.1355 1215.7035 1223.0868 1232.7726 1259.7952 1260.1375 1269.1366 1278.2869 1283.5869 1288.0504 1294.6419 1304.1690 1324.0262 1356.3857 1361.2060 1365.1664 1369.4635 1378.3185 1395.2263 1399.7084 1428.4032 1435.1471 1443.8602 1446.8017 1449.6296 1449.9836 1456.2486 1460.4975 1467.1754 1467.7944 1471.3564 1471.8590 1474.4799 1483.2169 1486.6609 1486.8659 1492.4247 1603.3686 1605.1251 1637.1500 2773.5103 2831.9521 2851.0632 2955.5077 2957.4311 2961.0634 2964.7831 2972.7254 2974.7910 3007.0548 3014.1639 3014.8514 3025.6082 3027.9373 3035.3162 3039.5855 3047.3310 3055.0876 3055.8733 3086.0897 3086.9802 3089.0021 3122.0342 3127.9760 3131.8988 3157.2110 3499.3486
redmass: 5.3848 5.8944 4.6714 4.2390 4.3311 3.7155 3.9652 3.8590 3.8186 1.8304 2.9143 3.9499 1.0690 3.1939 1.7026 1.1547 1.8099 2.5528 2.6175 2.5406 2.1207 4.1038 2.9802 2.8828 3.1390 3.0459 2.7814 2.3839 2.9576 2.9182 4.0047 3.4227 3.8790 3.3455 2.8536 1.7149 4.1500 2.4199 4.6966 3.8476 1.1771 1.8512 3.9928 1.2607 1.8793 2.9385 1.9643 1.9029 1.3109 3.1379 1.6367 3.1906 2.0926 1.3505 2.1134 1.6292 1.9186 1.7384 2.1289 1.6323 1.5708 1.6043 2.3199 1.8115 1.7902 2.0890 1.5168 1.6324 1.9866 1.8065 1.1676 1.5755 1.7586 1.8296 1.8564 1.6175 1.5321 1.5360 1.8771 1.2737 1.2535 1.3845 1.1676 1.2881 1.5750 1.5560 1.6781 3.9026 1.4004 1.2379 1.2676 1.1759 1.8610 1.0794 1.4988 1.1148 1.2440 1.2774 1.0734 1.1244 1.3961 1.0804 1.1117 1.0787 1.0546 1.1152 1.2623 1.3428 6.3152 6.1634 6.5212 1.0713 1.0701 1.0590 1.0629 1.0647 1.0421 1.0652 1.0617 1.0367 1.0915 1.0900 1.0847 1.0904 1.0722 1.0912 1.0923 1.0684 1.0971 1.0966 1.0997 1.0998 1.0980 1.0857 1.1110 1.0919 1.0995 1.0757
irintensity: 0.2311 0.2153 2.6487 0.6558 3.1013 1.5527 0.4326 0.3866 3.7070 0.1788 0.4530 1.3138 1.0006 5.7433 1.3191 0.3797 2.3014 0.6444 1.4130 1.8239 6.5828 5.9715 4.7955 0.3342 1.7907 2.0291 5.7053 0.7621 3.4151 3.5994 7.6169 1.1381 0.6583 7.2625 6.3386 25.0680 24.6129 45.5765 9.9388 6.5830 10.7286 11.0568 3.9789 58.6684 8.2026 6.2630 3.5740 4.8647 0.1662 7.2212 3.6553 6.1198 5.6995 0.2571 9.9157 3.1568 15.5077 3.8638 2.7627 5.1116 10.1649 26.7483 7.2417 15.4382 12.0605 2.6492 28.1399 2.2906 61.4602 8.0039 1.3415 11.2008 6.6900 41.3344 13.5107 1.7374 12.1931 10.6848 19.8192 2.9864 5.4097 7.3041 25.3784 1.6726 27.5986 0.7023 0.6530 16.5897 3.3466 34.4911 9.1244 7.4295 57.7475 8.9168 93.3110 3.5219 31.8126 17.3566 1.9056 10.8132 107.4303 22.2360 3.0044 8.8980 14.7022 39.7167 10.9130 65.1103 6.2378 3.5132 116.1089 143.2746 79.1131 207.9649 8.4784 27.7152 34.8747 14.7315 85.6061 21.3031 2.9916 20.9370 10.1929 35.1051 29.8041 9.3727 20.9183 17.4484 116.5612 13.1297 19.8243 35.8548 20.9716 0.2645 21.4060 25.3538 34.0932 8.7144
temp: 298.150 k
press: 1.00000 atm
elementType: 17 8 7 7 6 6 6 6 6 6 6 6 6 6 6 6 6 6 6 6 6 1 1 1 1 1 1 1 1 1 1 1 1 1 1 1 1 1 1 1 1 1 1 1 1 1 1 1
symmnumber: 1
zpe: 1074497.8 jmol-1
zpe.correction: 0.409255 hartree
zpe.thermalcorrener: 0.433341 hartree
zpe.thermalcorrenthalpy: 0.434286 hartree
zpe.thermalcorrgfe: 0.349262 hartree
zpe.sumelectzpe: -1307.162234 hartree
zpe.sumelectthermal: -1307.138147 hartree
zpe.sumelectthermalent: -1307.137203 hartree
zpe.sumelectthermalfe: -1307.222226 hartree
dipole: -4.1029 1.6021 2.7968
dipole: 5.2175
quadrupole: -147.3087 -116.9203 -139.9970
quadrupole: -10.5036 4.5421 -2.1630
quadrupole: -12.5667 17.8217 -5.2550 -10.5036 4.5421 -2.1630
hfenergy: -1307.5714888 hartree
pointgroup: C01 [X(C17H27Cl1N2O1)]
dipole: 1.5674244 0.7486646 -1.0938078 debye
polarizability: 270.7639665|-16.0386779|220.2183558|3.6389725|13.1313739|145.3682587 unknown
InChI: InChI=1S/C17H27ClN2O/c1-14-9-8-10-15(2)17(14)19-16(21)13-20(3)12-7-5-4-6-11-18/h8-10,19H,4-7,11-13H2,1-3H3
charge 0 multiplicity 1
48 atoms
Cl -7.613812 -1.064576 0.789063
O  0.492423 0.063843 1.29575
N  -1.174043 2.269532 0.158809
N  2.165434 0.959604 -0.081825
C  -2.829108 1.118001 -1.369395
C  -3.130364 -0.039248 -0.392859
C  -1.410598 1.702104 -1.190272
C  -4.572452 -0.573916 -0.526402
C  -4.868695 -1.720589 0.463983
C  0.248279 2.392748 0.498536
C  -1.930584 3.503967 0.434791
C  0.952867 1.018754 0.612652
C  -6.263467 -2.329713 0.339661
C  3.107839 -0.13005 -0.072454
C  4.450294 0.160181 0.316928
C  2.71904 -1.437023 -0.487301
C  5.401728 -0.885686 0.305321
C  3.702095 -2.458891 -0.466717
C  4.849471 1.560237 0.750592
C  1.317867 -1.744065 -0.972682
C  5.03029 -2.193818 -0.074516
H  -3.591851 1.913676 -1.250316
H  -2.920874 0.763089 -2.416759
H  -2.406223 -0.862183 -0.570566
H  -2.941205 0.309738 0.64013
H  -0.680726 0.883434 -1.340064
H  -1.215289 2.465182 -1.989582
H  -4.747451 -0.930282 -1.564059
H  -5.294255 0.248228 -0.350918
H  -4.706763 -1.373902 1.502585
H  -4.142724 -2.54597 0.294264
H  0.324104 2.873815 1.493134
H  0.812649 3.047991 -0.223289
H  -1.769909 3.810533 1.48378
H  -1.64229 4.360419 -0.227914
H  -3.010608 3.324958 0.302169
H  -6.427762 -3.162411 1.040362
H  -6.503362 -2.637668 -0.690512
H  2.474387 1.831055 -0.52187
H  6.433485 -0.67326 0.608657
H  3.416373 -3.470239 -0.778561
H  4.8217 2.284895 -0.088841
H  4.175925 1.946703 1.538017
H  5.878274 1.567214 1.147461
H  0.606468 -1.752045 -0.126922
H  0.961843 -0.972005 -1.681166
H  1.28459 -2.722468 -1.481421
H  5.773392 -2.99879 -0.07146
