program: Gaussian 09
title: 000032726
version: EM64L-G09RevD.01
frameworkgroup: C1[X(C12H13Cl6N5)]
method: RPBEPBE
basis: SDD
operation: Freq
keyword: #p
keyword: freq=noraman
keyword: PBEPBE/SDD
title: #p freq=noraman PBEPBE/SDD
converged: YES YES NO NO
title: Mulliken charges:
elementType: Cl Cl Cl Cl Cl Cl N N N N N C C C C C C C C C C C C H H H H H H H H H H H H H
charge: 0.117959 0.128309 0.128279 0.129708 0.125486 0.114001 -0.094721 -0.014601 -0.032055 0.083149 -0.005428 -0.401737 -0.333361 -0.387463 -0.339076 0.056429 -0.422075 -0.692788 0.265949 0.270809 -0.149186 -0.784675 -0.784663 0.260645 0.217062 0.190879 0.228228 0.245404 0.275754 0.193308 0.206430 0.251992 0.298764 0.218188 0.223046 0.212053
chargesum: 0.00000
title: Mulliken charges with hydrogens summed into heavy atoms:
elementType: Cl Cl Cl Cl Cl Cl N N N N N C C C C C C C C C C C C
charge: 0.117959 0.128309 0.128279 0.129708 0.125486 0.114001 -0.094721 -0.014601 -0.032055 0.083149 -0.005428 0.075970 0.085745 0.133695 0.060662 0.056429 0.128680 -0.039502 0.265949 0.270809 -0.149186 -0.784675 -0.784663
polarizability: 2.60606938e+02 1.72307930e+01 2.56159003e+02 -6.11170887e-01 -2.05647348e+00 1.69927994e+02
1716.lowfreq: -8.3955 -5.6366 -4.3831 0.0009 0.0021 0.0031 1.5391 3.4751 13.2009
frequency: -5.3190 2.7530 12.5862 20.5158 31.9105 43.3342 64.5037 65.6193 74.9459 80.6355 102.1560 114.0791 117.6523 146.0136 153.5931 161.9291 177.7878 183.1203 202.3255 217.9473 222.7160 226.3911 250.7467 254.7723 271.6490 281.6009 303.9155 306.7084 347.1578 361.1005 376.1578 388.5009 399.9172 418.8573 478.5792 485.8565 578.2180 608.6341 614.4134 653.0098 661.7580 721.3196 736.6575 749.9129 767.4099 767.6352 770.0660 776.7715 790.1614 836.1939 882.3502 900.6693 909.4029 932.3444 946.4620 998.7985 1010.5879 1019.7304 1028.8774 1070.5623 1076.3656 1112.0696 1139.5289 1175.3840 1196.1890 1238.5395 1243.4831 1269.8495 1282.5316 1288.7425 1293.4942 1305.8769 1324.1158 1342.7309 1346.0832 1359.5248 1365.3136 1391.9037 1418.5158 1449.6988 1455.0584 1462.9545 1468.9123 1476.0084 1477.0182 1488.2210 1490.9459 1573.3582 2201.9816 2967.6110 2977.0395 2978.5934 3002.9045 3004.4824 3013.6124 3037.8490 3045.1559 3065.3462 3074.0990 3079.4079 3090.1225 3107.5802
redmass: 23.3709 22.7664 4.2867 6.6869 10.5768 9.0596 5.2898 1.8550 5.2315 4.9401 2.8028 12.9251 4.1107 6.8950 8.3930 8.8585 13.5201 7.6396 4.0649 15.2833 12.4771 1.2206 10.1525 8.9121 5.8967 21.2550 6.3604 17.1066 6.8123 4.8123 5.5611 5.5510 4.2759 5.9805 5.7626 9.9523 5.0342 13.1813 5.4933 12.5794 12.8392 8.0020 1.0953 10.9347 6.0919 2.3407 2.9007 6.1891 1.2885 12.3636 6.4785 2.0708 4.2710 1.3495 4.5918 8.6469 4.0099 4.3303 2.5909 2.5694 2.2304 2.3423 2.0732 4.9440 2.3775 1.5608 1.7830 1.2721 1.4443 1.9190 1.1825 1.3496 1.6961 6.0989 1.4285 1.3346 1.2915 1.2095 9.5241 1.0969 1.1106 1.1436 1.0740 1.0467 1.0602 1.0857 10.2231 4.8637 12.4360 1.0593 1.0489 1.0489 1.0669 1.0592 1.0960 1.0595 1.0997 1.1014 1.1007 1.0995 1.1014 1.1070
irintensity: 0.0248 0.0123 0.0818 0.3770 1.7153 1.1804 0.4385 0.0511 4.3362 2.5259 0.2903 0.7726 0.8428 3.2541 2.6836 3.6216 0.6377 0.6345 0.7737 0.6633 0.0185 0.0462 0.2881 0.2857 1.0398 0.4944 4.0231 0.5256 0.9936 0.0940 1.4390 0.1515 0.7113 1.4621 17.4629 2.7022 13.5782 0.3284 23.8046 143.6354 110.1309 150.5335 7.4800 148.9176 17.7925 29.7792 5.0952 42.6490 3.8614 4.4281 90.7731 3.7065 2.4530 0.9126 3.0313 52.1717 10.5434 4.3301 7.2817 1.1549 3.7771 22.0452 22.6038 27.0515 2.3024 16.8660 7.2304 0.6965 14.5272 62.6540 7.1283 1.6685 0.6459 0.3190 0.7186 12.2824 41.3732 10.4977 292.9478 8.3726 26.5020 22.1122 1.1951 15.5841 6.7612 16.0349 289.3889 696.5692 13.4882 19.4074 19.5567 45.4710 28.5463 11.0572 7.2740 15.4485 24.8281 1.3452 55.8325 47.6459 17.7943 6.6522
temp: 298.150 k
press: 1.00000 atm
elementType: 17 17 17 17 17 17 7 7 7 7 7 6 6 6 6 6 6 6 6 6 6 6 6 1 1 1 1 1 1 1 1 1 1 1 1 1
symmnumber: 1
zpe: 635445.5 jmol-1
zpe.correction: 0.242028 hartree
zpe.thermalcorrener: 0.267273 hartree
zpe.thermalcorrenthalpy: 0.268217 hartree
zpe.thermalcorrgfe: 0.179922 hartree
zpe.sumelectzpe: -3497.418493 hartree
zpe.sumelectthermal: -3497.393249 hartree
zpe.sumelectthermalent: -3497.392304 hartree
zpe.sumelectthermalfe: -3497.480600 hartree
dipole: 5.1531 -1.4328 -0.5382
dipole: 5.3756
quadrupole: -169.0429 -218.0088 -172.3712
quadrupole: -4.8273 1.3386 0.0384
quadrupole: 17.4314 -31.5345 14.1031 -4.8273 1.3386 0.0384
hfenergy: -3497.6605216 hartree
pointgroup: C01 [X(C12H13Cl6N5)]
dipole: -1.2473325 1.6923347 -0.2302867 debye
polarizability: 275.5187332|1.5718551|241.0149903|-4.4499764|-2.6550182|170.1602111 unknown
InChI: InChI=1S/C12H13Cl6N5/c1-2-3-6-23(7-4-5-19)10-21-8(11(13,14)15)20-9(22-10)12(16,17)18/h2-4,6-7H2,1H3
charge 0 multiplicity 1
36 atoms
Cl 2.93737 -2.599766 2.114513
Cl 0.739783 -4.040229 0.624904
Cl 3.244241 -3.226372 -0.838266
Cl 4.01414 1.46445 -1.930006
Cl 1.951665 3.535676 -1.204317
Cl 3.695236 2.345287 0.956006
N  -1.701746 0.257207 -0.156274
N  0.481031 1.126299 -0.414276
N  0.10878 -1.222395 0.136305
N  2.35862 -0.364238 -0.084756
N  -4.712295 -3.628225 -0.372268
C  -2.269577 1.596085 -0.467101
C  -2.473117 2.46709 0.793355
C  -2.616472 -0.842168 0.218334
C  -3.115303 3.830317 0.448691
C  -0.354242 0.054662 -0.144408
C  -2.828933 -1.838632 -0.961396
C  -3.321245 4.71558 1.696348
C  1.79774 0.8477 -0.371741
C  1.449514 -1.3535 0.15405
C  -3.865683 -2.833281 -0.646061
C  2.038753 -2.732121 0.485517
C  2.789491 1.989312 -0.637791
H  -1.583657 2.106415 -1.162861
H  -3.235145 1.434524 -0.983518
H  -3.111799 1.930824 1.524645
H  -1.490678 2.629946 1.276121
H  -3.577926 -0.391611 0.515712
H  -2.20231 -1.392112 1.078924
H  -4.090578 3.66426 -0.053204
H  -2.472166 4.362396 -0.280846
H  -3.122682 -1.290463 -1.876247
H  -1.873677 -2.355964 -1.164105
H  -2.358369 4.921014 2.199793
H  -3.775546 5.686407 1.428354
H  -3.986317 4.222625 2.429969
