program: Gaussian 09
title: Benchmark H H Intermediate PBE(0) D3 singlet
version: ES64L-G09RevD.01
frameworkgroup: C1[X(C19H42MoNNaO3P2)]
method: RM06
basis: GenECP
operation: Freq
keyword: #P
keyword: Geom=AllCheck
keyword: Guess=TCheck
keyword: SCRF=Check
keyword: GenChk
keyword: RM06/GenECPFreq
converged: YES YES NO YES
title: Mulliken charges:
elementType: C H H C H H C H H C H H C H C H H H C H H H C H C H H H C H H H C H C H H H C H H H C H C H H H C H H H C C Mo N O O P P H O C H H H Na H H
charge: -0.373479 0.165787 0.223688 0.029200 0.147314 0.142401 0.141276 0.140046 0.148424 -0.432876 0.203741 0.169022 -0.365669 0.193761 -0.210319 0.159267 0.166916 0.146531 -0.126441 0.148086 0.156751 0.161611 -0.244631 0.154210 -0.202536 0.155000 0.149661 0.125830 -0.258521 0.178346 0.152529 0.150275 -0.404239 0.191531 -0.097522 0.162160 0.156804 0.148799 -0.234388 0.147327 0.168725 0.159655 -0.238883 0.153637 -0.261780 0.150828 0.151459 0.179286 -0.204557 0.123876 0.149806 0.155375 -1.071671 -0.436643 1.038411 -1.032926 -0.270172 -0.320851 -0.496267 -0.426706 0.495885 -0.668160 -0.105611 0.046628 0.072769 0.056810 0.722746 0.122598 0.020057
chargesum: 0.00000
title: Mulliken charges with hydrogens summed into heavy atoms:
elementType: C C C C C C C C C C C C C C C C C C Mo N O O P P O C Na
charge: 0.015996 0.318915 0.429747 -0.060113 -0.171908 0.262395 0.340007 -0.090421 0.227955 0.222629 -0.212709 0.370240 0.241320 -0.085246 0.219794 0.224501 -1.071671 -0.436643 1.058468 -0.537041 -0.270172 -0.320851 -0.496267 -0.426706 -0.545562 0.070597 0.722746
polarizability: 4.64311270e+02 2.19035511e+00 4.26598255e+02 -5.25415480e-01 -6.14907781e+00 3.83909437e+02
1716.lowfreq: -71.4338 -14.1793 -5.3790 -0.0021 -0.0019 -0.0019 12.7156 24.6232 28.6343
frequency: -70.7231 20.7058 26.6935 33.6938 39.9759 55.7573 57.0637 60.9436 70.2768 72.1220 74.5809 81.5995 83.1975 98.2575 99.9984 106.9177 108.7691 125.9744 130.3000 141.3662 142.2988 158.4892 163.9831 193.1278 200.4883 207.6034 210.5618 215.5869 216.9965 223.1003 228.5316 231.6421 241.2936 243.2558 246.6415 247.1513 256.1381 256.2705 260.0989 282.4931 288.3110 289.7509 300.0553 302.7776 316.2030 346.2520 352.8985 365.7765 367.0550 372.0593 381.8489 407.4690 423.7921 427.0879 434.6870 462.5016 464.4855 500.4001 504.3728 508.1057 520.7913 557.9435 561.2186 580.5484 612.8392 619.1812 624.5310 643.3058 645.2368 672.2810 692.0685 697.4271 711.1300 784.9616 829.7400 901.7627 903.6597 908.4035 909.7396 912.1308 914.3094 918.9197 920.0352 957.4790 960.0907 961.0145 964.6952 966.0289 979.6672 994.0672 1003.9399 1015.9624 1017.7909 1048.5927 1054.3510 1087.8178 1102.2216 1111.5101 1112.7109 1121.1851 1124.5175 1137.3849 1164.8971 1167.5094 1169.0506 1172.9986 1173.6605 1177.3216 1177.9329 1184.2745 1196.0807 1204.7971 1235.0809 1243.6046 1245.4632 1260.6948 1271.1514 1293.7667 1300.1432 1301.2881 1304.0458 1311.3813 1315.1489 1341.6237 1366.5959 1369.7456 1370.9877 1373.7205 1376.4622 1385.0177 1387.8954 1388.8296 1390.5336 1396.1370 1404.0496 1417.2875 1436.0479 1438.3043 1438.6823 1441.7186 1442.1975 1446.1130 1446.6880 1451.1362 1451.9489 1457.8466 1458.7212 1459.8270 1461.6509 1462.6720 1463.1184 1464.0628 1466.1786 1467.5133 1469.6853 1472.8936 1476.9957 1598.3116 1702.7322 1803.3511 2455.0912 2748.6292 2789.5858 2838.1367 2961.6776 2966.1703 3009.0383 3009.7915 3013.0412 3014.7625 3016.7951 3016.9483 3017.6324 3018.9303 3019.0577 3020.9508 3021.4342 3021.8234 3023.7126 3025.7838 3032.5789 3039.1362 3089.5983 3090.6183 3091.4513 3092.7878 3095.1898 3095.8409 3096.7222 3097.0109 3098.3403 3099.5919 3100.4165 3102.6726 3114.2002 3114.4400 3119.9206 3120.1469 3123.4381 3123.6228 3683.1377
redmass: 2.5594 3.0391 2.7899 3.0911 3.6888 4.8206 5.6401 5.2119 5.1459 9.3875 5.2127 2.6254 3.0687 3.6614 3.3272 7.9852 2.1022 2.0420 2.8297 3.7938 3.7664 4.1030 3.2776 3.3901 1.2366 2.7292 1.1544 2.5072 2.4928 1.3431 1.1560 3.5769 1.6871 2.0935 3.7846 1.5566 6.5307 1.8547 1.8212 1.4590 1.2699 1.4047 1.9051 2.2584 2.2023 2.5049 2.4045 3.3481 3.0700 1.5429 2.4708 2.0515 2.7251 2.3784 2.7455 2.5807 2.6183 2.4251 3.6271 3.1672 2.3551 8.9775 7.8202 2.6992 4.8203 4.1018 3.5878 3.7038 3.1696 2.7676 3.9343 3.8993 1.5006 1.9082 1.9171 1.5466 1.5884 1.9114 2.2067 1.2383 1.1658 1.4425 1.4258 1.4583 1.3589 1.3578 1.3515 1.3576 1.6205 1.7613 1.3714 1.2450 1.2604 1.3744 1.3938 3.1789 1.0672 2.2556 2.2672 2.3289 2.3600 1.8364 1.5489 1.6598 1.7427 1.8803 1.9053 1.9641 1.9256 2.2571 1.4339 1.2381 1.7577 1.4906 1.4894 1.4036 1.3549 1.2375 1.3660 1.4166 1.2622 1.3738 1.3491 1.3507 1.2431 1.2913 1.2841 1.2884 1.2887 1.2261 1.2350 1.2411 1.2431 1.1899 1.1453 1.1117 1.0460 1.0479 1.0474 1.0385 1.0386 1.0435 1.0421 1.0485 1.0470 1.0570 1.0474 1.0572 1.0435 1.0427 1.0457 1.0448 1.0495 1.0472 1.0767 1.1465 1.0918 1.1247 12.7708 12.9553 1.1116 1.0732 1.0724 1.0750 1.0631 1.0635 1.0379 1.0451 1.0652 1.0471 1.0396 1.0402 1.0512 1.0560 1.0520 1.0759 1.0726 1.0731 1.0770 1.0787 1.0746 1.0644 1.1020 1.1021 1.1010 1.1010 1.1019 1.1019 1.1006 1.1007 1.1035 1.1029 1.1027 1.1025 1.1019 1.1018 1.1010 1.1013 1.1015 1.1013 1.0081
irintensity: 3.9879 6.1282 0.5440 1.9110 0.7915 1.9234 1.2380 7.4443 16.5925 16.7141 0.1682 4.6022 6.0289 3.7336 1.2983 17.9429 3.0885 3.2064 1.6480 2.2865 1.4347 23.4806 0.8383 2.6139 0.2492 0.3440 0.0795 0.3350 3.7785 0.4365 5.7517 72.8583 1.1675 4.2437 3.7865 4.9891 52.6940 2.9103 2.2628 3.9230 6.2846 2.2380 5.7292 13.9272 2.9956 3.3916 7.7880 11.1974 5.8783 25.9166 1.1731 44.9605 23.3849 2.3133 8.9597 37.0451 5.1415 1.6026 6.8234 3.9970 31.5591 6.8557 1.4703 22.2577 10.3793 139.5400 31.7533 4.4579 24.4716 5.7567 15.6854 57.1983 25.1647 22.0003 92.1655 5.2305 5.8040 15.5711 12.1047 2.1021 3.3570 2.5118 1.7806 0.7115 2.6325 3.4326 0.2223 0.2493 17.1562 0.5532 12.4522 2.6147 13.2007 80.1976 17.6911 33.9913 64.8505 1.4670 5.3738 1.9899 6.2007 29.8622 90.5097 8.8870 113.5217 3.3573 1.6687 5.4994 0.3562 291.6102 23.7609 1.9672 18.2867 50.1390 3.2387 2.6807 2.5564 0.0168 0.1360 0.8847 0.9001 1.0757 1.3547 16.8086 25.2647 0.7719 1.9067 9.5186 12.7147 16.0469 20.3139 7.2641 5.9236 18.7168 13.2418 8.4830 2.4796 1.8492 2.5684 1.5610 1.9940 3.1290 7.1579 4.2998 5.3995 4.7900 2.8288 20.0945 17.8543 13.0456 6.6775 2.6167 25.6080 19.9129 1.9324 77.5010 21.7329 22.1036 1157.5160 1475.2663 1767.7395 294.1011 292.0587 316.1424 34.5804 196.8133 29.5943 30.9055 13.0005 40.6382 10.5487 81.1424 43.5002 17.1153 27.6559 17.5616 65.0315 79.9567 42.5209 44.5196 22.6340 28.2053 4.3044 2.2826 62.2619 71.9469 11.3661 12.9908 88.8740 53.5287 10.8160 12.3244 32.8326 29.1693 23.0407 26.2563 11.9986 18.5705 18.2411 25.3438 345.9345
temp: 373.150 k
press: 50.00000 atm
elementType: 6 1 1 6 1 1 6 1 1 6 1 1 6 1 6 1 1 1 6 1 1 1 6 1 6 1 1 1 6 1 1 1 6 1 6 1 1 1 6 1 1 1 6 1 6 1 1 1 6 1 1 1 6 6 42 7 8 8 15 15 1 8 6 1 1 1 11 1 1
symmnumber: 1
zpe: 1523088.2 jmol-1
zpe.correction: 0.580114 hartree
zpe.thermalcorrener: 0.636918 hartree
zpe.thermalcorrenthalpy: 0.638100 hartree
zpe.thermalcorrgfe: 0.485194 hartree
zpe.sumelectzpe: -1941.030093 hartree
zpe.sumelectthermal: -1940.973288 hartree
zpe.sumelectthermalent: -1940.972106 hartree
zpe.sumelectthermalfe: -1941.125013 hartree
dipole: 0.1608 -11.8414 -2.2831
dipole: 12.0605
quadrupole: -181.2350 -195.9982 -212.2389
quadrupole: 0.3069 0.3664 -8.3386
quadrupole: 15.2557 0.4925 -15.7482 0.3069 0.3664 -8.3386
hfenergy: -1941.6102065 hartree
pointgroup: C01 [X(C19H42Mo1N1Na1O3P2)]
dipole: 0.0147171 -4.6663352 -0.8601522 debye
polarizability: 464.3510812|1.792663|426.4541092|-0.6743746|-6.4924804|384.0137704 unknown
InChI: InChI=1S/C16H37NP2.CH3O.2CO.Mo.Na.2H/c1-13(2)18(14(3)4)11-9-17-10-12-19(15(5)6)16(7)8;3*1-2;;;;/h13-17H,9-12H2,1-8H3;1H3;;;;;;/q;;2*-1;;+2;;
charge 0 multiplicity 1
69 atoms
C  -2.40135721 1.77545948 -1.20879004
H  -3.32804343 1.85910097 -1.79212835
H  -2.31097043 2.67491057 -0.58115606
C  -1.17758359 1.7108722 -2.10976971
H  -1.23840336 0.86412982 -2.81343194
H  -1.12323675 2.63469362 -2.71556912
C  1.24889068 1.61157444 -2.12052677
H  1.25370156 2.51834662 -2.75297122
H  1.24768406 0.74408339 -2.80147764
C  2.48506318 1.6092697 -1.23435568
H  2.48497177 2.530245 -0.63214002
H  3.40610178 1.61146712 -1.83238249
C  -3.3194763 1.12329001 1.43248876
H  -2.61842268 1.93165285 1.69830604
C  -3.43153168 0.17634075 2.62076234
H  -3.73459012 0.72993428 3.51954299
H  -2.48153013 -0.32859035 2.84021619
H  -4.19600878 -0.5945948 2.44860184
C  -4.6701401 1.74509688 1.10134994
H  -5.42049435 0.98154568 0.85352745
H  -4.61849869 2.45547739 0.26758461
H  -5.05215842 2.29546216 1.97207162
C  -3.64541926 -0.88182448 -0.73737665
H  -4.65329816 -0.47422748 -0.55927326
C  -3.51660526 -2.23016273 -0.03423264
H  -4.31859318 -2.90908503 -0.35488086
H  -3.55023288 -2.15777227 1.05912714
H  -2.55839156 -2.69270504 -0.31055506
C  -3.44917248 -1.06287407 -2.23800572
H  -2.42780555 -1.39626818 -2.46687975
H  -3.64479362 -0.14653618 -2.80655808
H  -4.13673737 -1.83244652 -2.6154707
C  3.37476318 0.93509529 1.41677511
H  2.72959638 1.78852553 1.68531905
C  4.75911771 1.46686317 1.06838386
H  5.18657568 1.9942596 1.93211077
H  4.74473391 2.17541346 0.23158284
H  5.45494637 0.65500049 0.8153417
C  3.43738448 -0.00809223 2.6118305
H  4.14771838 -0.828611 2.43727376
H  2.45864132 -0.44772765 2.84519979
H  3.78602769 0.530878 3.50280593
C  3.56116585 -1.11196111 -0.72624825
H  4.59317988 -0.77013612 -0.54841148
C  3.35743285 -1.29488741 -2.2258124
H  3.99535284 -2.11089785 -2.59269066
H  3.61325133 -0.39930321 -2.80341079
H  2.31761815 -1.56494782 -2.45491714
C  3.34236058 -2.44278298 -0.01196806
H  2.35480342 -2.84104708 -0.28489125
H  3.38133047 -2.36435692 1.08070832
H  4.09666069 -3.17620723 -0.32808523
C  -0.0583384 -1.67277365 -0.96675674
C  -0.06262226 -1.62155411 1.50965218
Mo -0.01652896 -0.2046613 0.21994835
N  0.03590161 1.56949633 -1.30040489
O  -0.08982751 -2.73812301 -1.54546643
O  -0.09670535 -2.63181853 2.17238631
P  -2.43114672 0.34576664 -0.01924581
P  2.42722803 0.19816795 -0.02016064
H  0.04948248 2.37863566 -0.58586829
O  -0.03353137 3.41525027 0.58961789
C  0.51545902 4.57722654 0.14403442
H  0.64291062 4.62234521 -0.97355341
H  -0.08509981 5.4857063 0.39049498
H  1.5360673 4.79322635 0.55348944
Na -0.12848526 -4.05224064 0.35763455
H  0.05539748 1.6693483 1.57150104
H  -0.03374674 1.00790796 1.97896454
