program: Gaussian 09
title: Benchmark H H Intermediate PBE(0) D3 singlet
version: ES64L-G09RevD.01
frameworkgroup: C1[X(C19H42MoNNaO3P2)]
method: RM06
basis: GenECP
operation: Freq
keyword: #P
keyword: Geom=AllCheck
keyword: Guess=TCheck
keyword: SCRF=Check
keyword: GenChk
keyword: RM06/GenECPFreq
converged: YES YES YES YES
title: Mulliken charges:
elementType: C H H C H H C H H C H H C H C H H H C H H H C H C H H H C H H H C H C H H H C H H H C H C H H H C H H H C C Mo N O O P P H O C H H H Na H H
charge: -0.392620 0.165576 0.207586 0.101293 0.140310 0.133447 0.012283 0.137990 0.140607 -0.382468 0.208009 0.165349 -0.378365 0.185688 -0.209139 0.158768 0.167046 0.147058 -0.136167 0.149094 0.155961 0.161529 -0.244857 0.153410 -0.207173 0.155062 0.148282 0.123959 -0.262376 0.179377 0.151787 0.149819 -0.380691 0.185499 -0.135503 0.161515 0.155919 0.149145 -0.204178 0.146707 0.166808 0.158595 -0.249469 0.153659 -0.262275 0.149739 0.152085 0.179341 -0.199639 0.123835 0.147919 0.155076 -1.058217 -0.426866 1.114057 -1.132830 -0.273785 -0.330416 -0.450038 -0.423215 0.527939 -0.623822 -0.120367 0.059722 0.084158 0.063461 0.724865 0.085475 0.039668
chargesum: 0.00000
title: Mulliken charges with hydrogens summed into heavy atoms:
elementType: C C C C C C C C C C C C C C C C C C Mo N O O P P O C Na
charge: -0.019457 0.375049 0.290880 -0.009110 -0.192677 0.263732 0.330416 -0.091447 0.220130 0.218606 -0.195192 0.331077 0.267933 -0.095810 0.218890 0.227191 -1.058217 -0.426866 1.153725 -0.604891 -0.273785 -0.330416 -0.450038 -0.423215 -0.538347 0.086974 0.724865
polarizability: 4.65195954e+02 3.55290996e-01 4.26063824e+02 -7.60665659e-02 -6.62669054e+00 3.83765932e+02
1716.lowfreq: -825.1054 -0.0012 -0.0008 0.0005 11.2365 15.7199 18.6392 33.8681 41.4275
frequency: -825.1053 33.5056 41.3266 51.0650 55.5145 57.6270 60.7625 65.7420 69.2658 74.3815 83.2946 86.3642 89.7792 102.8277 105.4429 110.3234 120.1624 127.5844 138.0805 147.8618 152.7391 157.6020 166.9594 182.0669 195.2987 211.3087 221.4634 222.2574 227.5944 230.3528 237.7406 240.4143 242.0054 249.6075 253.7126 255.8565 256.7704 267.4432 271.1321 273.6644 296.0444 297.7313 310.9621 318.4731 338.8249 349.3855 365.0642 367.0796 376.2714 380.3968 400.7181 402.0036 429.9311 436.4470 447.0434 466.2567 467.6795 501.5161 509.9514 511.1514 532.7202 550.2259 565.7544 572.4403 613.7424 622.2134 623.3940 643.6536 644.5419 675.3561 692.4621 696.5025 735.5485 758.1343 821.2177 833.8945 905.0942 905.6997 911.1890 911.6498 913.2028 914.2855 919.4673 920.7493 958.3563 961.4434 961.6632 965.8560 966.0524 985.0760 993.9913 1014.8892 1018.7504 1020.4244 1049.7070 1055.2141 1091.7458 1112.4930 1113.8823 1121.2743 1124.6333 1137.9344 1138.4423 1170.1659 1172.6474 1174.1966 1174.6613 1179.7184 1180.2197 1180.8483 1195.0001 1196.8331 1230.8475 1246.9308 1248.7619 1257.5533 1265.2588 1266.3277 1291.3774 1300.5969 1302.7033 1304.5927 1310.5881 1312.5974 1339.4758 1370.6110 1370.7631 1375.4016 1375.9616 1386.4538 1386.9484 1391.0848 1391.4957 1397.5223 1411.6443 1416.3579 1443.3389 1443.8308 1444.3684 1445.2393 1447.5825 1447.9804 1448.6233 1453.9204 1454.3964 1460.0703 1462.0766 1462.3744 1463.4053 1464.4985 1466.7181 1467.0920 1467.8406 1468.5434 1472.9839 1483.4781 1500.2183 1572.8885 1604.7841 1697.9316 1798.6773 2803.9824 2819.4508 2889.6301 2946.4263 2953.3541 2995.0789 2997.4900 3011.7811 3011.8899 3015.2365 3015.8929 3017.3845 3017.5062 3018.9615 3019.5011 3019.9944 3020.4364 3023.2464 3023.5798 3033.3171 3033.5692 3091.2692 3091.5655 3093.6318 3093.9581 3095.8024 3095.9384 3097.1262 3097.2967 3099.1892 3099.3845 3102.6901 3103.0871 3115.9319 3117.0228 3121.1925 3121.7391 3122.7685 3122.8685 3919.4085
redmass: 1.3738 3.6375 3.9615 3.1530 3.9823 3.5118 4.7505 4.5111 10.0462 6.6218 4.7223 3.7318 3.2330 3.6466 6.1194 4.1220 3.3020 4.0765 2.3895 3.5515 1.4041 3.7966 3.2833 3.2718 4.0124 2.7142 3.2374 4.3428 1.1078 1.1209 1.1531 1.2760 4.0835 3.2283 1.9204 1.3727 5.4238 1.9048 1.6969 2.2212 1.1597 1.1569 2.3411 2.2151 2.3388 2.6560 2.6593 2.8092 3.2701 2.3073 2.5867 1.3938 2.2991 2.5968 1.1620 2.5806 2.6220 3.5990 3.1101 4.9148 1.4019 6.8225 14.5969 3.1014 3.7109 4.3543 3.5760 3.6252 3.1243 7.6230 3.9422 3.5546 2.1680 1.1922 1.9010 1.8962 1.5983 1.6031 2.1866 2.1292 1.1380 1.1560 1.4494 1.4445 1.5291 1.3527 1.3527 1.3533 1.3512 1.5653 1.6941 1.3472 1.2449 1.2734 1.3737 1.3932 3.8467 2.2743 2.2986 2.3135 2.3577 1.0864 1.7034 1.6869 1.6615 1.5802 1.7978 1.8189 1.8532 1.5784 1.4440 2.0163 1.5866 1.4658 1.4597 1.9887 1.3732 1.3834 1.2357 1.2552 1.3935 1.3809 1.3845 1.3717 1.3575 1.2848 1.2844 1.2853 1.2851 1.2293 1.2315 1.2446 1.2448 1.4283 1.1018 1.1190 1.0385 1.0452 1.0399 1.0459 1.0444 1.0456 1.0464 1.0482 1.0482 1.0620 1.0479 1.0430 1.0430 1.0435 1.0446 1.0463 1.0510 1.0515 1.0690 1.0830 1.1829 1.0989 1.1063 12.6730 12.9146 1.0555 1.0841 1.0829 1.0611 1.0604 1.0983 1.1007 1.0389 1.0387 1.0557 1.0547 1.0379 1.0379 1.0671 1.0554 1.0479 1.0515 1.0741 1.0741 1.0626 1.0622 1.1018 1.1017 1.1012 1.1012 1.1017 1.1017 1.1005 1.1005 1.1033 1.1031 1.1025 1.1024 1.1016 1.1014 1.1020 1.1021 1.1010 1.1009 1.0079
irintensity: 3809.9231 6.2950 0.0984 1.1597 3.6924 3.7951 0.7474 3.8463 13.9665 18.4176 0.9448 10.3805 1.4972 1.5586 4.9367 7.2947 15.0259 3.6863 0.0876 1.8989 0.6832 8.3028 0.0418 10.3598 4.0502 0.5589 2.3928 0.6124 0.1166 0.1417 0.5734 2.2663 9.7349 1.5975 14.0942 1.0496 42.4249 0.2214 0.0621 0.4260 0.2377 0.2206 0.5149 1.3150 6.7783 2.5707 1.5147 22.4769 9.1796 1.1855 8.4296 2.5088 2.2353 6.2209 71.7830 40.1709 1.0334 6.2929 1.3575 4.8980 2.5425 13.5489 3.2808 4.3193 27.1099 123.1957 44.5655 3.8961 25.1695 12.8271 17.0233 136.3849 429.7538 35.2345 253.3314 90.2854 4.8274 5.0077 14.5207 12.2148 3.0715 4.1496 3.4920 2.8328 1.4192 2.4718 2.9823 0.7568 0.6418 21.1189 1.8461 79.4768 0.8991 44.2783 89.7994 2.1809 13.9964 1.6834 7.3293 2.2015 4.0112 36.8088 36.8252 7.9393 11.6868 2.9964 0.4923 8.0184 2.9267 16.6603 28.6505 84.9119 5.6511 52.2041 2.0245 124.1896 0.1101 0.1072 0.7476 3.0636 0.8425 0.9249 0.8499 0.5804 22.5928 0.8836 2.6496 11.2196 17.9133 4.5565 32.3360 8.5285 8.6766 73.5326 13.2293 9.8311 1.8907 2.0064 1.8450 2.6171 5.7760 4.3537 13.0758 7.2915 6.7393 2.0879 10.8484 18.6611 18.0163 1.3798 6.9397 24.3925 11.8578 10.5130 4.3891 52.1762 46.7803 160.7822 64.4997 1173.2660 1382.8737 215.8804 258.9480 257.4062 54.0005 210.6403 67.8442 3.7219 5.7109 63.9012 23.7757 22.4878 9.8595 74.4014 17.7667 30.7595 90.4047 66.4828 68.5734 51.6943 26.0709 18.6493 7.3335 7.6305 35.6728 86.9914 3.8231 11.2246 117.4644 28.9311 12.5497 12.2494 38.2958 22.6107 23.9432 24.5787 20.6035 22.0052 6.2937 22.8478 118.2157
temp: 373.150 k
press: 50.00000 atm
elementType: 6 1 1 6 1 1 6 1 1 6 1 1 6 1 6 1 1 1 6 1 1 1 6 1 6 1 1 1 6 1 1 1 6 1 6 1 1 1 6 1 1 1 6 1 6 1 1 1 6 1 1 1 6 6 42 7 8 8 15 15 1 8 6 1 1 1 11 1 1
symmnumber: 1
zpe: 1520414.1 jmol-1
zpe.correction: 0.579095 hartree
zpe.thermalcorrener: 0.635377 hartree
zpe.thermalcorrenthalpy: 0.636558 hartree
zpe.thermalcorrgfe: 0.487271 hartree
zpe.sumelectzpe: -1941.031004 hartree
zpe.sumelectthermal: -1940.974723 hartree
zpe.sumelectthermalent: -1940.973541 hartree
zpe.sumelectthermalfe: -1941.122829 hartree
dipole: -0.1076 -11.2111 -2.0013
dipole: 11.3888
quadrupole: -181.8720 -193.0545 -213.5294
quadrupole: -0.5314 -0.1101 -5.0090
quadrupole: 14.2800 3.0974 -17.3775 -0.5314 -0.1101 -5.0090
hfenergy: -1941.6100995 hartree
pointgroup: C01 [X(C19H42Mo1N1Na1O3P2)]
dipole: -0.0456384 -4.4134742 -0.7719661 debye
polarizability: 465.1964663|0.3256039|426.016476|-0.0819299|-6.7742951|383.8127676 unknown
InChI: InChI=1S/C16H37NP2.CH3O.2CO.Mo.Na.2H/c1-13(2)18(14(3)4)11-9-17-10-12-19(15(5)6)16(7)8;3*1-2;;;;/h13-17H,9-12H2,1-8H3;1H3;;;;;;/q;;2*-1;;+2;;
charge 0 multiplicity 1
69 atoms
C  -2.44496581 1.76709035 -1.10097183
H  -3.36338745 1.84557464 -1.69821776
H  -2.40636293 2.63907117 -0.43014965
C  -1.20148616 1.783311 -1.97798697
H  -1.23079504 0.96518575 -2.71955485
H  -1.17410499 2.72977757 -2.55052017
C  1.2117053 1.80882453 -1.96187538
H  1.18773897 2.77614696 -2.49991058
H  1.24673947 1.01697232 -2.73076865
C  2.4507624 1.7662521 -1.07893233
H  2.4150452 2.62510684 -0.3916909
H  3.37148507 1.84939981 -1.67220066
C  -3.38872389 0.91940486 1.48584801
H  -2.73618882 1.74307127 1.81894642
C  -3.47637656 -0.10201397 2.61321625
H  -3.83282991 0.3787122 3.53402885
H  -2.50537726 -0.56673646 2.82949679
H  -4.19117441 -0.90216206 2.37457827
C  -4.76279957 1.49344847 1.16441647
H  -5.47368073 0.70713297 0.8751225
H  -4.73533314 2.23912309 0.36090603
H  -5.18041645 1.98790442 2.05226402
C  -3.59315799 -0.95840358 -0.7966468
H  -4.61761572 -0.60577531 -0.59716824
C  -3.41076434 -2.34314569 -0.18082559
H  -4.19026745 -3.02863651 -0.54071579
H  -3.4395056 -2.34151062 0.9150546
H  -2.43932299 -2.75221767 -0.4924076
C  -3.39109946 -1.03809166 -2.30533449
H  -2.35957289 -1.32149917 -2.55438245
H  -3.61901414 -0.09574984 -2.81621248
H  -4.05238326 -1.80632977 -2.72970545
C  3.39207782 0.87975657 1.49313171
H  2.74875438 1.70800912 1.83274818
C  4.7729007 1.44074353 1.17746177
H  5.19447148 1.92482542 2.0691649
H  4.75507032 2.19182172 0.37874498
H  5.47543265 0.64835683 0.8843581
C  3.46767226 -0.15162137 2.61221945
H  4.17251706 -0.95863712 2.36711654
H  2.49108911 -0.60591909 2.8252906
H  3.83032914 0.31742387 3.53664598
C  3.5791958 -0.97175475 -0.81259255
H  4.60645887 -0.62671763 -0.61430395
C  3.3690136 -1.03264572 -2.32100158
H  4.02165844 -1.8012101 -2.75793675
H  3.60228964 -0.08589781 -2.82128477
H  2.33377472 -1.30416357 -2.56810989
C  3.39239602 -2.36181825 -0.21030911
H  2.41646013 -2.76179606 -0.51962823
H  3.42875289 -2.37120165 0.88534486
H  4.1652558 -3.04834785 -0.58239864
C  -0.00791811 -1.60493773 -1.01770856
C  -0.00731699 -1.68900264 1.44713928
Mo -0.00259325 -0.19911196 0.23644304
N  0.0011782 1.65264403 -1.15572165
O  -0.01250857 -2.63836566 -1.65359155
O  -0.00982681 -2.73869816 2.04792748
P  -2.43629883 0.27295205 0.0081496
P  2.43260482 0.25736252 0.00939072
H  0.00532198 2.48234669 -0.36428748
O  0.03731838 3.44105653 0.64530032
C  0.04820806 4.66775261 0.04264196
H  -0.54978159 4.71224546 -0.90438041
H  -0.37137543 5.47481689 0.68285757
H  1.06748771 5.0269618 -0.24594642
Na -0.00839194 -4.06247232 0.16638568
H  0.0027484 1.61191188 1.71141059
H  -0.00380332 0.94995591 2.10799866
