program: Gaussian 09
title: 000032729
version: EM64L-G09RevD.01
frameworkgroup: C1[X(C14H20Cl3N5)]
method: RPBEPBE
basis: SDD
operation: Freq
keyword: #p
keyword: freq=noraman
keyword: PBEPBE/SDD
title: #p freq=noraman PBEPBE/SDD
converged: YES YES NO NO
title: Mulliken charges:
elementType: Cl Cl Cl N N N N N C C C C C C C C C C C C C C H H H H H H H H H H H H H H H H H H H H
charge: 0.097815 0.121407 0.112187 -0.139542 -0.064493 -0.042709 0.014365 -0.011535 -0.011414 -0.367659 -0.401265 -0.715190 0.072416 -0.691091 -0.422702 0.042694 -0.458635 -0.365633 0.252225 -0.682146 -0.150850 -0.784204 0.194735 0.250773 0.199257 0.277314 0.240120 0.210271 0.265245 0.219172 0.202667 0.226209 0.224189 0.247270 0.297583 0.221862 0.222175 0.235517 0.208863 0.216062 0.211660 0.225019
chargesum: 0.00000
title: Mulliken charges with hydrogens summed into heavy atoms:
elementType: Cl Cl Cl N N N N N C C C C C C C C C C C C C C
charge: 0.097815 0.121407 0.112187 -0.139542 -0.064493 -0.042709 0.014365 -0.011535 0.183321 0.082371 0.116169 -0.020502 0.072416 -0.038027 0.122150 0.042694 -0.014598 0.078747 0.252225 -0.029406 -0.150850 -0.784204
polarizability: 2.62023718e+02 1.89074318e+01 2.35903118e+02 -5.94228616e+00 -4.83457002e+00 1.63971546e+02
1716.lowfreq: -10.8417 -5.4270 -3.5118 -0.0025 -0.0021 -0.0020 5.2282 13.5341 23.4077
frequency: -9.4794 13.2178 23.3584 31.4168 42.5290 47.3488 65.3177 74.9188 81.7280 96.6631 111.5646 120.2501 148.5658 152.4143 168.8473 187.7299 198.6203 205.3697 210.5977 223.2130 231.0231 237.9427 254.9899 271.7186 286.7407 296.9704 314.9967 333.5584 368.2265 376.9531 382.4931 410.5667 459.6627 472.9194 507.1667 536.2296 589.5888 627.1617 636.6792 691.1734 714.3227 742.3085 753.8879 756.7350 764.7888 788.5959 818.4971 833.9273 859.4813 877.5431 891.9253 905.3439 944.2090 958.0601 978.1778 994.6234 1006.3460 1014.5457 1039.3498 1052.0903 1060.0023 1087.6198 1100.1668 1115.6686 1132.6691 1155.6323 1176.7523 1193.0888 1225.7672 1235.4944 1262.9790 1274.2343 1275.6994 1281.1655 1290.6302 1306.4823 1315.0468 1331.2666 1337.6581 1359.4663 1362.9660 1371.3169 1383.4107 1390.0978 1392.7327 1427.9005 1446.7260 1450.7706 1457.1354 1462.7899 1466.5500 1475.5767 1476.4559 1480.2728 1484.5260 1485.4398 1490.6248 1492.3757 1553.1036 2199.3942 2975.1079 2975.8243 2986.6682 2987.0706 2992.2152 2994.5164 3003.2915 3007.7506 3037.8783 3039.6827 3053.3970 3064.6654 3071.4196 3077.5279 3078.6643 3079.3585 3081.5223 3088.5456 3107.7087 3112.3779
redmass: 18.7832 3.2098 5.3524 9.2093 3.2094 5.2339 4.5721 3.1181 1.7489 4.2133 3.2013 5.3700 4.6676 6.1542 5.2073 2.7453 2.7291 2.4964 2.1469 4.0688 1.1731 1.4405 3.4682 6.0439 5.6285 5.4311 4.3660 3.4627 3.5539 3.8617 9.6425 3.5406 3.4222 5.2938 4.1969 4.4173 5.3257 6.6983 5.7904 7.9975 4.6663 1.5501 1.5654 3.0777 6.0894 1.3628 2.2667 5.4481 2.2482 1.4563 2.0406 10.8548 4.5573 1.3921 2.4970 2.5273 1.9225 4.2475 3.5045 2.8332 1.9737 2.0935 1.8382 2.5896 2.6139 2.1338 4.0607 2.5564 1.4755 1.7718 1.2811 1.3518 1.3234 1.2572 1.2225 1.5149 2.0838 1.4237 1.5221 3.1636 1.2645 1.4784 1.2743 1.2138 1.2145 5.0857 1.1212 1.2468 1.1189 1.0884 1.0775 1.0574 1.0484 1.0488 1.0666 1.0869 1.1331 4.2924 3.9387 12.4337 1.0368 1.0356 1.0608 1.0474 1.0746 1.0629 1.0585 1.0595 1.0596 1.1000 1.0968 1.1012 1.1012 1.0992 1.0997 1.0983 1.1000 1.1036 1.1063 1.0996
irintensity: 0.0435 0.0987 0.4459 1.1996 0.2144 0.1372 1.3425 7.0893 0.0675 0.1679 0.1260 0.5501 1.4297 5.8710 2.9067 0.7647 0.4074 0.4963 0.0591 0.2142 0.0692 0.1950 0.5033 0.2471 0.9251 0.2571 0.9889 1.2169 0.7782 2.2821 0.5088 0.3384 2.5426 3.1372 10.0735 1.4678 34.5496 61.2425 45.1769 42.9226 4.4471 37.5458 41.7294 60.3502 87.1886 9.0165 4.9461 0.7123 17.6133 4.5668 5.3186 17.0679 2.6701 14.1445 6.9295 28.3907 9.5669 1.8222 3.5116 0.9795 1.7713 44.3161 18.6874 18.2222 26.1822 23.6776 24.2097 2.2198 3.8323 2.5611 2.9627 7.5078 6.2951 0.1626 16.6082 68.6920 34.2087 9.1490 1.8893 72.9058 47.9796 23.3292 27.7969 5.2314 20.4699 315.5394 10.6959 28.3893 31.7397 5.3364 6.5336 2.9110 10.8745 8.5661 7.6536 18.7357 51.2473 280.4427 641.3541 16.9286 29.0952 40.6784 11.8890 12.9441 22.4416 47.0177 8.3328 22.4304 24.5495 0.4494 4.4902 1.8585 19.2755 37.5404 25.2878 24.5540 78.9843 49.1628 4.9651 18.6465
temp: 298.150 k
press: 1.00000 atm
elementType: 17 17 17 7 7 7 7 7 6 6 6 6 6 6 6 6 6 6 6 6 6 6 1 1 1 1 1 1 1 1 1 1 1 1 1 1 1 1 1 1 1 1
symmnumber: 1
zpe: 856933.2 jmol-1
zpe.correction: 0.326389 hartree
zpe.thermalcorrener: 0.350815 hartree
zpe.thermalcorrenthalpy: 0.351759 hartree
zpe.thermalcorrgfe: 0.269005 hartree
zpe.sumelectzpe: -2197.724975 hartree
zpe.sumelectthermal: -2197.700549 hartree
zpe.sumelectthermalent: -2197.699604 hartree
zpe.sumelectthermalfe: -2197.782359 hartree
dipole: -1.1682 6.8418 -0.8570
dipole: 6.9935
quadrupole: -162.8665 -165.2549 -149.4008
quadrupole: -15.1702 2.2881 2.2412
quadrupole: -3.6924 -6.0808 9.7732 -15.1702 2.2881 2.2412
hfenergy: -2198.0513637 hartree
pointgroup: C01 [X(C14H20Cl3N5)]
dipole: -1.0010523 2.5367741 0.3650472 debye
polarizability: 271.3008082|3.0038548|226.174314|-10.2870058|1.0195286|164.42326 unknown
InChI: InChI=1S/C14H20Cl3N5/c1-4-7-11-19-12(14(15,16)17)21-13(20-11)22(9-6-8-18)10(3)5-2/h10H,4-7,9H2,1-3H3
charge 0 multiplicity 1
42 atoms
Cl -1.709764 -3.496688 -1.679491
Cl 1.019786 -3.687383 -0.399543
Cl -1.446204 -3.984897 1.303029
N  1.32283 1.280963 -0.069056
N  -0.997838 1.114006 0.454739
N  0.340674 -0.852664 -0.083017
N  -2.0157 -1.086564 0.41293
N  5.681822 -1.017929 -0.152726
C  1.36023 2.762258 0.198451
C  0.499686 3.566332 -0.812642
C  2.562805 0.613795 -0.529032
C  1.019933 3.105543 1.666541
C  0.198776 0.51712 0.106817
C  0.905048 3.346126 -2.284355
C  3.326671 -0.065445 0.649239
C  -2.064061 0.27799 0.596365
C  -3.403027 0.872821 0.941698
C  -4.356386 0.885909 -0.289585
C  -0.788379 -1.57013 0.077589
C  -5.750166 1.43871 0.071206
C  4.627883 -0.598313 0.217852
C  -0.712059 -3.087604 -0.151203
H  2.419629 3.03712 0.024135
H  -0.561447 3.304699 -0.657918
H  0.612446 4.637386 -0.551229
H  2.308863 -0.15965 -1.271329
H  3.201145 1.372533 -1.01056
H  1.650023 2.530892 2.369429
H  -0.038428 2.892066 1.882984
H  1.206137 4.1806 1.841834
H  1.959541 3.632106 -2.462772
H  0.276565 3.9538 -2.95963
H  0.783963 2.287979 -2.580995
H  3.490286 0.658726 1.469273
H  2.703014 -0.891217 1.037439
H  -3.255842 1.899453 1.318341
H  -3.866848 0.26033 1.7372
H  -4.443364 -0.145729 -0.678872
H  -3.903059 1.500011 -1.092242
H  -6.233465 0.818936 0.849316
H  -5.6850 2.474047 0.455165
H  -6.412822 1.447556 -0.813075
