program: Gaussian 09
title: 000032686
version: EM64L-G09RevD.01
frameworkgroup: C1[X(C9H13Cl3N4)]
method: RPBEPBE
basis: SDD
operation: Freq
keyword: #p
keyword: freq=noraman
keyword: PBEPBE/SDD
title: #p freq=noraman PBEPBE/SDD
converged: YES YES NO NO
title: Mulliken charges:
elementType: Cl Cl Cl N N N N C C C C C C C C C H H H H H H H H H H H H H
charge: 0.093429 0.119375 0.107723 -0.328846 -0.034000 -0.073422 0.003051 -0.411573 -0.323383 -0.339243 -0.687594 0.016664 0.287383 0.073207 -0.760782 -0.747353 0.201937 0.208372 0.233930 0.239872 0.201895 0.200853 0.334573 0.210373 0.222532 0.211185 0.247027 0.245575 0.247242
chargesum: 0.00000
title: Mulliken charges with hydrogens summed into heavy atoms:
elementType: Cl Cl Cl N N N N C C C C C C C C C
charge: 0.093429 0.119375 0.107723 0.005726 -0.034000 -0.073422 0.003051 -0.001265 0.150419 0.063504 -0.043504 0.016664 0.287383 0.073207 -0.760782 -0.007509
polarizability: 2.07922583e+02 1.46482629e+01 1.60214953e+02 7.47979568e-01 7.26552009e-01 1.12291194e+02
1716.lowfreq: -3.5376 -0.0013 0.0020 0.0028 3.0835 7.9327 8.6160 14.2815 47.4914
frequency: 7.4908 13.6383 47.4858 60.7994 67.7436 85.5402 103.8485 125.1328 128.4179 161.1791 172.2138 208.6470 217.1068 226.9322 237.7227 240.4845 252.5880 291.4224 313.7551 355.8752 381.2705 429.1220 530.3297 554.7516 568.1204 594.4043 645.7367 650.0553 734.5292 741.4690 754.2959 756.2807 790.9651 823.8601 896.2822 902.0950 936.4272 958.7264 971.5372 1027.2905 1047.7413 1051.2421 1079.8450 1104.8225 1136.2394 1152.8436 1184.0598 1221.7650 1270.6943 1277.3225 1292.6961 1294.6946 1332.7016 1351.5366 1365.1056 1387.9658 1393.2239 1398.7225 1445.6628 1452.9889 1468.5042 1472.9751 1473.9284 1479.1544 1485.1700 1493.4132 1506.1845 1577.0462 2962.7056 2976.4755 2976.9280 2988.8486 3001.0590 3006.2510 3029.0881 3051.2234 3073.3466 3078.6678 3082.7406 3136.6822 3552.5835
redmass: 2.6572 15.7865 5.4175 1.5134 1.2081 8.5487 2.1694 5.5694 3.1466 5.5631 5.3351 6.5795 15.9878 1.6353 8.7308 2.0345 5.0923 16.6388 7.6231 3.9373 11.7783 3.5097 4.6147 5.9391 1.2142 4.3817 7.7573 6.0608 1.0849 8.2804 8.9388 9.5261 1.1665 9.7827 2.7120 4.4554 1.1765 6.0844 2.4078 3.5790 3.1203 1.6478 2.3297 2.5731 3.2720 1.6158 6.4223 1.2919 1.5836 1.1372 2.1653 1.2404 1.8187 2.4578 1.6700 1.9821 1.2250 1.8074 1.3018 1.0461 1.1835 2.1666 1.1167 1.0421 1.0728 1.1246 3.0349 7.1866 1.0590 1.0392 1.0565 1.0614 1.0377 1.0983 1.1023 1.1044 1.1011 1.0993 1.0964 1.1004 1.0770
irintensity: 0.2060 0.0071 0.3126 0.9231 0.2831 0.3780 0.0393 0.4007 2.9034 1.8770 0.0837 0.9048 0.3667 0.0243 0.8516 0.0343 0.7293 0.0865 0.0188 2.7637 0.0684 0.2061 23.6518 10.1313 69.5226 76.9088 29.6681 23.3078 16.2154 84.7805 82.7773 99.8554 4.2199 0.2323 22.2431 6.2667 0.4663 8.7930 1.8368 3.0064 9.7816 7.4392 1.4278 3.8708 15.9893 1.8113 13.4230 0.8389 5.9307 0.9289 7.8065 2.4666 15.2530 42.5578 32.5414 92.8794 2.3755 88.1746 105.9571 17.0357 39.4977 177.4255 11.3961 13.5695 24.8268 52.5049 134.4824 772.7726 9.9669 60.8392 13.9899 34.4452 2.9308 2.0005 5.0099 36.3883 88.3617 45.0768 7.5207 10.8370 76.7269
temp: 298.150 k
press: 1.00000 atm
elementType: 17 17 17 7 7 7 7 6 6 6 6 6 6 6 6 6 1 1 1 1 1 1 1 1 1 1 1 1 1
symmnumber: 1
zpe: 568707.2 jmol-1
zpe.correction: 0.216609 hartree
zpe.thermalcorrener: 0.234856 hartree
zpe.thermalcorrenthalpy: 0.235801 hartree
zpe.thermalcorrgfe: 0.165619 hartree
zpe.sumelectzpe: -1948.717568 hartree
zpe.sumelectthermal: -1948.699321 hartree
zpe.sumelectthermalent: -1948.698377 hartree
zpe.sumelectthermalfe: -1948.768558 hartree
dipole: -5.0894 1.9810 -0.1213
dipole: 5.4626
quadrupole: -108.2753 -113.1886 -115.4069
quadrupole: 4.2661 0.0257 0.0222
quadrupole: 4.0149 -0.8983 -3.1166 4.2661 0.0257 0.0222
hfenergy: -1948.9341776 hartree
pointgroup: C01 [X(C9H13Cl3N4)]
dipole: 1.9034425 -0.9973675 -0.0331825 debye
polarizability: 210.577756|9.0146794|157.5638452|-0.1958393|-0.6709703|112.2871293 unknown
InChI: InChI=1S/C9H13Cl3N4/c1-3-4-5-13-8-15-6(2)14-7(16-8)9(10,11)12/h13H,3-5H2,1-2H3
charge 0 multiplicity 1
29 atoms
Cl -3.265097 1.813524 1.627454
Cl -1.275953 3.080218 -0.257604
Cl -3.690798 1.671154 -1.37278
N  1.62783 -1.012295 -0.051628
N  -0.315043 0.313759 -0.056888
N  -0.431128 -2.13394 -0.022335
N  -2.462082 -0.813205 -0.017368
C  3.989521 -0.264048 0.043181
C  2.516007 0.166111 -0.079959
C  4.948695 0.947888 0.005507
C  6.430547 0.534695 0.127793
C  0.27034 -0.94046 -0.04356
C  -1.666517 0.290244 -0.042644
C  -1.785521 -2.016439 -0.008903
C  -2.406307 1.637509 -0.026502
C  -2.616274 -3.268123 0.016562
H  4.247844 -0.958079 -0.783501
H  4.137724 -0.819342 0.991785
H  2.352834 0.728439 -1.020009
H  2.236902 0.847662 0.745084
H  4.687747 1.644948 0.826816
H  4.79436 1.505924 -0.939693
H  2.028105 -1.952909 -0.050615
H  6.725721 -0.13849 -0.69892
H  7.096273 1.416008 0.098677
H  6.617832 0.001694 1.078834
H  -3.289133 -3.292484 -0.859085
H  -1.97093 -4.1582 0.017293
H  -3.2635 -3.273165 0.911705
