program: Gaussian 09
title: 000032673
version: EM64L-G09RevD.01
frameworkgroup: C1[X(C6H4Cl6N4)]
method: RPBEPBE
basis: SDD
operation: Freq
keyword: #p
keyword: freq=noraman
keyword: PBEPBE/SDD
title: #p freq=noraman PBEPBE/SDD
converged: NO NO NO NO
title: Mulliken charges:
elementType: Cl Cl Cl Cl Cl Cl N N N N C C C C C C H H H H
charge: 0.118576 0.129626 0.118971 0.118556 0.130965 0.118946 0.076806 -0.025079 -0.019981 -0.317758 0.293632 0.289740 0.023188 -0.772823 -0.775277 -0.598500 0.347476 0.260174 0.222542 0.260220
chargesum: 0.00000
title: Mulliken charges with hydrogens summed into heavy atoms:
elementType: Cl Cl Cl Cl Cl Cl N N N N C C C C C C
charge: 0.118576 0.129626 0.118971 0.118556 0.130965 0.118946 0.076806 -0.025079 -0.019981 0.029718 0.293632 0.289740 0.023188 -0.772823 -0.775277 0.144436
polarizability: 1.63293911e+02 8.00191212e+00 1.83312369e+02 1.99953549e-03 -2.30951299e-03 1.17472976e+02
1716.lowfreq: -11.1902 -8.8919 -5.2917 0.0025 0.0030 0.0031 5.6227 6.0753 30.1151
frequency: -9.2940 -3.2795 29.7716 58.2520 79.6686 94.9599 120.8948 124.7952 157.6593 179.7252 199.5997 208.6774 221.4064 234.6313 251.3525 254.6879 279.9354 309.8135 310.9235 362.8262 378.0340 410.9908 505.9925 595.4786 606.9376 611.3769 653.2220 660.6544 732.9656 754.1499 768.7135 770.4640 784.5887 837.9393 896.8811 961.2642 1002.1490 1099.7131 1124.4073 1147.5948 1202.2004 1297.8820 1318.5208 1382.0076 1436.3790 1460.6473 1467.7096 1483.9389 1497.9441 1595.9683 3000.1954 3084.2275 3120.4131 3561.7310
redmass: 32.1166 9.0750 1.0616 14.0532 24.7561 6.8779 4.6287 7.0122 15.2134 33.0619 8.3331 14.5332 17.6643 7.9592 20.8875 7.6723 22.1892 19.0778 16.1577 14.0347 26.6869 12.3926 7.9548 1.2316 10.8800 6.2513 9.0221 12.8964 10.0608 10.8262 11.9425 11.9570 9.3078 12.2909 13.3211 6.0666 6.7867 2.8181 1.2884 3.6588 3.4609 8.6924 6.7093 3.0361 1.4118 1.0387 2.7090 1.3265 2.4459 5.4892 1.0344 1.1014 1.1019 1.0776
irintensity: 0.0180 0.3765 0.0238 0.0440 0.0490 0.3265 1.5887 3.8575 2.1442 0.0213 0.9661 1.7293 0.0063 0.1181 0.1944 1.3519 0.2905 3.5372 0.7519 0.4436 0.5148 0.5502 11.5709 134.4574 2.7120 20.3494 112.7855 110.1503 172.0106 183.1909 0.6370 54.4095 28.6844 1.0615 20.1849 29.5070 41.4598 10.8279 1.4012 3.5866 21.3349 41.3787 4.0319 143.9383 58.4207 17.1559 143.9077 77.4167 114.3421 651.6163 35.1192 17.3198 19.5785 96.0449
temp: 298.150 k
press: 1.00000 atm
elementType: 17 17 17 17 17 17 7 7 7 7 6 6 6 6 6 6 1 1 1 1
symmnumber: 1
zpe: 273304.0 jmol-1
zpe.correction: 0.104096 hartree
zpe.thermalcorrener: 0.119851 hartree
zpe.thermalcorrenthalpy: 0.120795 hartree
zpe.thermalcorrgfe: 0.058880 hartree
zpe.sumelectzpe: -3209.183546 hartree
zpe.sumelectthermal: -3209.167791 hartree
zpe.sumelectthermalent: -3209.166846 hartree
zpe.sumelectthermalfe: -3209.228761 hartree
dipole: 0.8323 6.0927 0.0003
dipole: 6.1493
quadrupole: -142.4769 -111.7807 -132.2098
quadrupole: 3.7579 0.0095 0.0003
quadrupole: -13.6544 17.0418 -3.3874 3.7579 0.0095 0.0003
hfenergy: -3209.2876415 hartree
pointgroup: C01 [X(C6H4Cl6N4)]
dipole: 0.5524017 2.3553924 0.0001267 debye
dipolederiv: -0.1825832 0.0257314 -0.0393858 0.0356773 -0.3439493 -0.2950061 -0.0557902 -0.2533939 -0.5558797 -0.5999857 -0.2367412 -0.0019487 -0.2244033 -0.224778 -0.0009327 -0.0016894 -0.0009905 -0.1267293 -0.1821924 0.0238052 0.0412246 0.0335347 -0.3459677 0.2961178 0.0578439 0.2542183 -0.5520199 -0.2327327 -0.0712113 0.0692645 -0.0834288 -0.3052812 0.290412 0.040839 0.2586049 -0.5576008 -0.4092898 0.3047235 -0.0016288 0.297227 -0.4257504 0.0017359 -0.0013344 0.0016916 -0.1258266 -0.2312122 -0.0705674 -0.0678092 -0.0825234 -0.3086781 -0.292251 -0.039013 -0.2602186 -0.5533864 -1.5283545 0.2026534 -0.0005778 0.1564788 -0.5765261 0.0001216 -0.0015695 0.0003682 -0.0708203 -0.7470312 -0.6286725 -0.0001257 -0.1396674 -1.0873191 0.000205 -0.000457 -0.0006256 -0.2000663 -0.4525452 0.4516137 -0.0002178 -0.2086067 -1.3038286 -0.000143 -0.0000448 0.0008932 -0.1815878 -0.3220809 -0.1457704 0.0000722 -0.4101276 -1.4527244 -0.0000984 0.000237 0.0005734 -0.4352289 0.9889073 -0.2411805 0.0001623 -0.0540067 0.9142393 0.0000742 -0.0002322 0.0007408 -0.0358822 1.0805817 0.1174206 0.0001422 0.0527271 0.7905437 -0.0001476 -0.0005623 -0.0008034 -0.0359887 0.3826968 0.198563 -0.0001985 0.4580087 2.0885336 -0.0000051 0.0000909 -0.0003779 0.2914965 1.0152106 0.257033 0.0004207 0.3184065 0.860701 -0.0003085 0.0007469 -0.0008643 1.2735219 0.837281 -0.2254053 0.0005311 -0.296661 1.0870182 0.0000809 0.0010213 0.0005087 1.278365 0.3925117 0.250575 0.0002718 0.1359002 0.3616114 0.0000756 0.000168 -0.000073 0.2034757 0.1133281 -0.1120103 -0.0001528 -0.0319555 0.2751307 -0.0000324 -0.0001594 -0.0001613 0.3280747 0.0014839 -0.0812751 -0.0561568 0.0331648 0.076325 0.0718244 -0.0867438 0.0208591 -0.0382809 0.0747184 0.0616917 -0.0001267 -0.0232298 -0.1556194 0.000152 -0.0000909 0.0002558 0.1321245 0.0012883 -0.0809762 0.056239 0.0334854 0.0763196 -0.0718745 0.0867399 -0.0212056 -0.0377603 unknown
polarizability: 164.97741|9.7415531|181.628851|0.0283836|-0.0048983|117.4729947 unknown
InChI: InChI=1S/C6H4Cl6N4/c1-13-4-15-2(5(7,8)9)14-3(16-4)6(10,11)12/h13H,1H3
charge 0 multiplicity 1
20 atoms
Cl 1.999677 -2.478139 -1.520216
Cl 3.826489 -0.625647 0.007848
Cl 1.992192 -2.485891 1.516873
Cl -2.902595 -1.562821 1.520056
Cl -3.940978 0.822895 -0.008433
Cl -2.897938 -1.57369 -1.516113
N  -0.241957 -0.898367 0.000077
N  -1.061903 1.376631 -0.001117
N  1.344841 0.929123 0.00091
N  0.492258 3.126241 -0.000343
C  1.018821 -0.382296 0.00081
C  -1.2351 0.04002 -0.00079
C  0.261993 1.788191 -0.000178
C  2.156165 -1.414228 0.001637
C  -2.66677 -0.513239 -0.001619
C  1.83674 3.717075 0.000902
H  -0.340924 3.718073 -0.001022
H  2.405547 3.401319 0.892677
H  1.740993 4.814346 0.000022
H  2.407648 3.400103 -0.889081
