program: Gaussian 16
title: 2b_OAc_BH_ts1_optforw_freq
version: ES64L-G16RevB.01
method: RB3LYP
basis: Gen
operation: Freq
keyword: #
keyword: B3LYP/gen
keyword: pseudo=read
keyword: EmpiricalDispersion=GD3
keyword: freq
keyword: scrf=(solvent=acetonitrile,SMD)
hfenergy: -1315.836182 hartree
pointgroup: C01 [X(C19H22O6Pd1)]
dipole: 2.2278153 1.3141574 0.7233908 debye
polarizability: 444.7490383|7.0440171|404.8422888|-7.0047338|12.0603446|348.7386054 unknown
InChI: InChI=1S/C17H18O4.C2H3O2.Pd.H/c1-16(2)20-14-11-7-10-13(12-8-5-4-6-9-12)17(14,21-16)15(18)19-3;1-2(3)4;;/h4-11,13H,1-3H3;1H3;;/q;-1;+1;
charge 0 multiplicity 1
48 atoms
C  1.89297 0.30737 1.33722
C  -0.12018 -0.03895 2.83293
C  -1.03126 0.54524 1.84182
C  0.95883 1.02279 0.29814
C  -0.53331 0.98334 0.60674
H  -1.95643 0.99701 2.2072
O  1.15798 2.43603 0.39438
C  1.28466 0.54953 -1.1402
O  2.35288 1.18175 -1.61327
O  0.67222 -0.29705 -1.74943
O  -1.0658 2.08175 -0.03622
H  -0.48614 -1.50344 0.4004
C  -0.04091 3.11464 -0.02338
C  -0.38103 4.14784 1.03274
H  -0.52396 3.65514 2.00234
H  0.44056 4.87184 1.11529
H  -1.29775 4.6833 0.7559
C  0.08959 3.6829 -1.42289
H  0.33406 2.89671 -2.14532
H  -0.85765 4.15233 -1.71801
H  0.87993 4.44391 -1.4373
C  2.84084 0.76681 -2.90058
H  4.34241 0.27667 0.13294
H  5.56316 -1.64416 -0.85392
C  3.90374 -0.72059 0.17009
C  4.5885 -1.80326 -0.38924
C  2.64571 -0.8983 0.76492
C  4.02805 -3.08432 -0.35147
C  2.10155 -2.19036 0.81545
C  2.78264 -3.27466 0.25666
H  1.13673 -2.34932 1.29745
H  2.33896 -4.27094 0.29847
C  1.20501 -0.07764 2.62358
H  -0.54464 -0.38066 3.77715
H  2.65654 1.06227 1.57338
H  4.56148 -3.93053 -0.7881
H  2.0838 0.95455 -3.67229
H  3.73416 1.3699 -3.08694
H  3.09593 -0.30018 -2.88087
H  -6.08895 -1.03628 -1.38243
O  -3.9449 -0.16449 -0.29496
C  -5.30999 -1.80562 -1.42633
H  -5.10373 -2.06758 -2.47443
C  -4.04197 -1.32471 -0.77839
H  -5.65539 -2.71819 -0.91946
Pd -1.75557 -0.71756 0.2547
O  -3.04046 -2.12597 -0.72615
H  1.86694 -0.46307 3.40059
