program: Gaussian 16
title: 4b_BH_ON_OAcZ_ts1
version: ES64L-G16RevB.01
method: RB3LYP
basis: Gen
operation: Freq
keyword: #N
keyword: Geom=AllCheck
keyword: Guess=TCheck
keyword: SCRF=Check
keyword: GenChk
keyword: RB3LYP/ChkBas
keyword: Freq
hfenergy: -1448.5305863 hartree
pointgroup: C01 [X(C21H25N1O6Pd1)]
dipole: 2.9526928 -1.5545011 -1.294863 debye
polarizability: 524.3890131|-2.2561689|417.2237127|-9.1020809|34.5909488|373.6043881 unknown
InChI: InChI=1S/C17H18O4.C2H3N.C2H3O2.Pd.H/c1-16(2)20-14-11-13(12-7-5-4-6-8-12)9-10-17(14,21-16)15(18)19-3;1-2-3;1-2(3)4;;/h4-11,13H,1-3H3;1H3;1H3;;/q;;-1;+1;
charge 0 multiplicity 1
54 atoms
C  -1.06401476 -2.74335893 1.01219285
C  0.20254876 -3.03586912 0.70726303
C  1.07338871 -2.28530095 -0.27038075
C  0.28331253 -1.26448552 -1.10371925
C  -1.77496331 -1.52340077 0.4797006
C  -1.0737808 -1.01141667 -0.80431057
H  -1.63494531 -3.34564282 1.72055931
H  0.6712302 -3.90466098 1.17493259
O  -3.06753248 -1.85951202 0.00324648
C  -1.83639739 -0.47562987 1.62910115
O  -3.04845569 0.01646974 1.80982912
O  -0.86880635 -0.18155811 2.29482073
O  -1.99789365 -1.00969406 -1.79840497
H  -1.15167616 0.71460876 -0.38099423
C  -3.32159535 -1.21321611 -1.24480746
C  -4.06271128 -2.1805642 -2.14209242
H  -3.50351896 -3.1202319 -2.22219226
H  -5.05461151 -2.38247394 -1.71836003
H  -4.1907466 -1.74298592 -3.13990494
C  -4.02522288 0.12761121 -1.08950954
H  -3.42100187 0.84171397 -0.52274701
H  -4.22560352 0.54357689 -2.08541203
H  -4.97927173 -0.02187647 -0.56938879
C  -3.18792395 1.05628072 2.79760427
C  2.35193797 -1.76763976 0.38308091
C  3.47218399 -0.47765919 2.11186236
C  4.71386612 -0.74331054 1.52122815
C  4.77338086 -1.53151853 0.36795769
C  2.30036297 -0.9875231 1.54848323
C  3.59801129 -2.04239125 -0.19382605
H  3.41667401 0.13487843 3.0138678
H  5.73585109 -1.74446595 -0.10080745
H  3.64908178 -2.65073222 -1.09895065
H  1.33288992 -0.76336997 1.9958532
H  1.40085644 -3.03771834 -1.00603576
H  5.62854123 -0.33884585 1.95810152
H  -2.55167208 1.90548923 2.52425884
H  -4.2429849 1.34418547 2.77322742
H  -2.91620072 0.67398309 3.78952964
H  -0.28605818 4.94481076 1.44581132
O  0.19875656 2.86117531 -0.25243125
C  -0.83489966 4.8484996 0.49650706
H  -0.27191428 5.40260247 -0.266817
C  -0.92040769 3.37358183 0.12946197
H  -1.83457913 5.28130908 0.61682815
Pd 0.35226215 0.80437983 -0.68558579
O  -1.99856158 2.76848485 0.22958901
H  0.4903533 -1.32404159 -2.17498763
H  5.38047444 0.49689465 -1.96448113
C  4.95010175 1.43123193 -1.57993568
C  3.53478472 1.2422047 -1.33030494
N  2.40953266 1.08510103 -1.12743896
H  5.45288712 1.70224989 -0.64155901
H  5.09069118 2.23382121 -2.31704287
