program: Gaussian 16
title: TS6_OAc-Ztu_ts1
version: ES64L-G16RevB.01
method: RB3LYP
basis: Gen
operation: Freq
keyword: #N
keyword: Geom=AllCheck
keyword: Guess=TCheck
keyword: SCRF=Check
keyword: GenChk
keyword: RB3LYP/ChkBas
keyword: Freq
hfenergy: -1448.507677 hartree
pointgroup: C01 [X(C21H25N1O6Pd1)]
dipole: 2.953723 2.8577553 -1.4420073 debye
polarizability: 489.0724908|42.0432747|504.1277607|-1.9125976|-29.185394|405.2476464 unknown
InChI: InChI=1S/C11H14O4.C6H5.C2H3N.C2H3O2.Pd/c1-10(2)14-8-6-4-5-7-11(8,15-10)9(12)13-3;1-2-4-6-5-3-1;1-2-3;1-2(3)4;/h4-8H,1-3H3;1-5H;1H3;1H3;/q;;;-1;+1
charge 0 multiplicity 1
54 atoms
C  2.03366704 1.80872551 -0.9285284
C  0.87976446 1.7379933 -1.61065528
C  0.09553057 0.50044671 -1.72750244
C  0.51560206 -0.66877693 -1.01009348
C  2.58765799 0.61621468 -0.18971613
C  1.59056994 -0.53322126 0.064571
H  2.62265893 2.72572885 -0.90696593
H  0.51510992 2.61308316 -2.15001549
H  0.60307734 -1.5886053 -1.57949151
H  -0.38159441 0.33996151 -2.69999277
O  3.59463516 -0.02059087 -0.97313252
C  3.14493855 1.1304035 1.16085561
O  4.37247514 1.61620896 1.02903493
O  2.51352581 1.137546 2.19575944
O  2.43612268 -1.67187178 0.10459958
H  1.14176134 -0.40579061 1.05085934
C  3.64190135 -1.41616914 -0.63794878
C  3.65389232 -2.20988416 -1.93364377
H  2.77568828 -1.95447757 -2.53860179
H  4.56236241 -1.97962441 -2.50567001
H  3.64080606 -3.28465156 -1.71195064
C  4.82827499 -1.72138838 0.26395811
H  4.78244644 -1.11711009 1.17748592
H  4.81866048 -2.78342125 0.5422316
H  5.7650194 -1.50347706 -0.26451644
C  4.99145449 2.16982734 2.20629918
H  -6.07626944 -0.05098551 1.89354557
H  -4.87739137 -1.24370978 2.4672622
C  -5.02100517 -0.1976997 2.15400424
C  -4.11969348 0.07299356 0.95430143
O  -2.88500569 0.26391547 1.25092331
H  -4.74716636 0.44310095 3.00299541
O  -4.5943589 0.07053393 -0.1936913
H  -0.33225376 -1.59198633 1.85258421
Pd -1.45020896 0.44851651 -0.32870947
C  -0.88766915 -2.15064043 1.09998864
H  -1.23187339 -3.81839694 2.42258381
C  -1.11785086 -1.60322403 -0.1702519
C  -1.40245038 -3.40904052 1.42504186
C  -1.82252415 -2.35430384 -1.12959617
C  -2.13681405 -4.13768205 0.4823132
C  -2.34481202 -3.60583587 -0.79690326
H  -1.96136663 -1.9587737 -2.13669333
H  -2.53649272 -5.12024758 0.73911045
H  -2.907512 -4.17162777 -1.54201481
H  5.07352183 1.40170229 2.9858246
H  5.98510363 2.50128072 1.89054681
H  4.40348628 3.01766768 2.58008709
C  -2.33602456 3.54771747 -0.64973522
C  -2.76950236 4.92553989 -0.76816439
H  -2.9403923 5.34306062 0.2341012
H  -3.70395406 4.96725783 -1.34522583
H  -1.99469072 5.51129732 -1.28223154
N  -1.98978802 2.4505707 -0.55560618
