program: Gaussian 09
title: 000032667
version: EM64L-G09RevD.01
frameworkgroup: C1[X(C9H13Cl3N4)]
method: RPBEPBE
basis: SDD
operation: Freq
keyword: #p
keyword: freq=noraman
keyword: PBEPBE/SDD
title: #p freq=noraman PBEPBE/SDD
converged: YES YES NO NO
title: Mulliken charges:
elementType: Cl Cl Cl N N N N C C C C C C C C C H H H H H H H H H H H H H
charge: 0.100478 0.113694 0.100213 -0.111002 -0.038907 -0.069702 -0.006785 -0.355573 -0.355595 0.090301 -0.660374 -0.659981 0.255085 0.064792 -0.762340 -0.750305 0.263661 0.211985 0.257893 0.214084 0.209104 0.250730 0.221650 0.212135 0.246226 0.220593 0.239960 0.241696 0.256285
chargesum: 0.00000
title: Mulliken charges with hydrogens summed into heavy atoms:
elementType: Cl Cl Cl N N N N C C C C C C C C C
charge: 0.100478 0.113694 0.100213 -0.111002 -0.038907 -0.069702 -0.006785 0.120073 0.116383 0.090301 0.021109 0.018971 0.255085 0.064792 -0.762340 -0.012365
polarizability: 1.93144400e+02 1.51946353e+01 1.73469113e+02 -3.06507290e+00 -1.94839306e+00 1.15692734e+02
1716.lowfreq: -41.5203 -8.8212 -5.1489 -0.0016 0.0012 0.0021 2.5816 10.8632 38.9364
frequency: -41.4254 7.8821 38.8125 42.7012 57.9017 88.3331 96.5809 112.6483 168.4832 170.8787 192.2522 209.4970 214.8495 218.7690 221.9299 258.8836 284.5992 292.2296 315.3807 360.0315 377.3441 391.5666 489.1792 536.2065 556.5876 578.1365 593.1916 652.8606 695.0090 748.3563 754.2345 772.8762 776.5910 822.4183 832.9712 899.8046 930.9758 960.9735 988.4345 1015.0037 1051.7921 1070.6645 1076.3826 1083.7322 1097.9512 1179.3932 1193.7612 1214.5559 1284.6378 1298.6849 1322.5858 1348.9864 1359.4204 1363.0965 1384.5872 1386.5420 1396.0682 1418.0447 1456.2665 1457.7483 1460.0540 1467.0351 1468.3990 1470.4330 1481.3143 1483.1658 1497.7604 1572.3611 2988.0421 2988.2553 3000.1666 3010.9256 3016.0344 3075.7603 3076.7489 3083.8907 3090.7995 3091.4618 3104.1752 3106.1438 3137.5521
redmass: 1.0223 10.8547 2.9593 3.5457 2.7405 4.4487 7.9014 4.6967 4.1902 5.0578 4.5495 2.2784 4.4325 1.4826 3.6702 1.7355 6.0545 15.0861 3.2119 5.4743 2.9766 4.8582 4.3475 3.7112 4.2732 4.4806 4.9678 6.8604 7.9559 9.5703 9.3241 1.3851 1.1781 9.7532 2.5459 10.5491 2.2897 2.4978 4.7522 2.3772 1.6511 2.3723 2.0778 1.8703 1.7878 5.8479 2.3451 3.8245 2.1245 1.3434 2.1977 1.2537 3.2421 1.2945 1.2117 1.2333 1.4876 3.2772 1.0767 1.0684 1.1299 1.3090 1.0979 1.0506 1.0575 1.0584 6.8264 4.8923 1.0356 1.0355 1.0386 1.0636 1.0638 1.0997 1.0996 1.0955 1.0983 1.0982 1.1027 1.1030 1.1003
irintensity: 0.6448 0.0127 0.0690 0.0056 0.0790 1.6781 0.3529 0.9398 3.1354 0.1047 1.1016 0.0895 0.8357 0.2557 0.0717 0.0972 0.9126 0.1501 0.0185 3.3701 1.4236 1.8589 10.5871 1.7768 4.0054 23.3290 41.3693 42.1869 53.9527 121.7341 90.3897 48.6157 3.7482 1.4297 5.1528 23.1129 0.2002 3.2617 22.7894 26.3791 8.4998 2.8700 9.0496 26.2716 11.2018 38.3391 4.7457 4.9023 57.7031 18.4859 10.4132 5.9744 22.6966 31.9458 2.5104 37.0113 38.3984 298.6136 30.6465 16.9021 38.6550 76.1440 12.7421 5.0929 6.7530 19.2560 265.1792 608.8347 23.6451 27.8479 4.4022 28.7903 49.8467 15.2400 4.3892 9.4010 38.0906 25.9016 9.3642 43.2813 7.8195
temp: 298.150 k
press: 1.00000 atm
elementType: 17 17 17 7 7 7 7 6 6 6 6 6 6 6 6 6 1 1 1 1 1 1 1 1 1 1 1 1 1
symmnumber: 1
zpe: 567273.6 jmol-1
zpe.correction: 0.216063 hartree
zpe.thermalcorrener: 0.233491 hartree
zpe.thermalcorrenthalpy: 0.234435 hartree
zpe.thermalcorrgfe: 0.167549 hartree
zpe.sumelectzpe: -1948.713472 hartree
zpe.sumelectthermal: -1948.696045 hartree
zpe.sumelectthermalent: -1948.695101 hartree
zpe.sumelectthermalfe: -1948.761986 hartree
dipole: -5.6942 -0.3323 -0.0976
dipole: 5.7047
quadrupole: -110.3229 -109.6681 -115.3657
quadrupole: 3.3019 -0.4713 -0.3159
quadrupole: 1.4626 2.1175 -3.5801 3.3019 -0.4713 -0.3159
hfenergy: -1948.9295356 hartree
pointgroup: C01 [X(C9H13Cl3N4)]
dipole: -2.2433366 -0.0184685 0.0664531 debye
polarizability: 195.144083|-13.7619269|171.5202035|2.2642234|-1.8365301|115.6419599 unknown
InChI: InChI=1S/C9H13Cl3N4/c1-4-16(5-2)8-14-6(3)13-7(15-8)9(10,11)12/h4-5H2,1-3H3
charge 0 multiplicity 1
29 atoms
Cl 3.615379 -0.040832 -1.649365
Cl 2.467403 2.476041 -0.450272
Cl 3.721685 0.407552 1.350099
N  -2.128986 0.549361 -0.005166
N  0.225048 0.627246 -0.085633
N  -0.951581 -1.490002 0.237698
N  1.471041 -1.438166 0.162415
C  -2.164822 2.016881 -0.230922
C  -3.413981 -0.173737 0.156362
C  -0.941217 -0.120022 0.050989
C  -2.109532 2.818096 1.086258
C  -3.982329 -0.670013 -1.189732
C  1.361102 -0.089444 -0.028706
C  0.268022 -2.093655 0.292453
C  2.693011 0.659863 -0.186289
C  0.3029 -3.583378 0.499108
H  -1.307121 2.2895 -0.866241
H  -3.095234 2.23955 -0.785259
H  -3.243408 -1.03154 0.826553
H  -4.121969 0.519207 0.647271
H  -2.931709 2.535228 1.768589
H  -1.148538 2.643307 1.598976
H  -2.195796 3.899552 0.875541
H  -4.129639 0.16437 -1.899215
H  -3.295346 -1.40256 -1.646203
H  -4.959178 -1.162267 -1.031777
H  -0.329079 -3.867287 1.357985
H  -0.107697 -4.098749 -0.388545
H  1.33747 -3.917903 0.661926
