program: Gaussian 09
title: andres
version: ES64L-G09RevD.01
frameworkgroup: C1[X(C18H42Cl3Mo3N6O4S4)]
method: RM11
basis: Gen
operation: Freq
keyword: #P
keyword: Geom=AllCheck
keyword: Guess=TCheck
keyword: SCRF=Check
keyword: GenChk
keyword: RM11/ChkBas
keyword: Freq
converged: YES YES NO YES
title: Mulliken charges:
elementType: C Mo Cl Mo N C Mo N C C N C S C C O S S Cl N C N C N C S C C O Cl C C C O C O C H H H H H H H H H H H H H H H H H H H H H H H H H H H H H H H H H H H H H H H H C H H
charge: -0.242837 -0.130599 -0.232918 -0.234444 -0.565286 -0.235886 -0.079232 -0.580103 -0.124518 -0.137607 -0.555713 -0.243682 0.084216 -0.089067 0.541473 -0.370798 0.029445 0.287510 -0.262378 -0.587397 -0.231923 -0.562988 -0.133801 -0.586259 -0.244633 0.102234 -0.083638 0.536118 -0.392377 -0.294866 -0.139826 -0.124656 -0.245312 -0.422944 -0.163662 -0.411146 -0.165033 0.179186 0.173039 0.193728 0.156300 0.192337 0.177180 0.189457 0.175689 0.160192 0.170532 0.190298 0.154696 0.191500 0.194823 0.153053 0.177798 0.195504 0.148230 0.174703 0.167794 0.176350 0.168137 0.175562 0.167420 0.162121 0.178033 0.169884 0.365034 0.177943 0.195615 0.357303 0.345332 0.354004 0.354515 0.360059 0.143067 0.156967 0.183686 0.169333 0.194345 -0.129543 0.168497 0.184837
chargesum: 1.00000
title: Mulliken charges with hydrogens summed into heavy atoms:
elementType: C Mo Cl Mo N C Mo N C C N C S C C O S S Cl N C N C N C S C C O Cl C C C O C O C C
charge: 0.293656 -0.130599 -0.232918 -0.234444 -0.210771 0.289788 -0.079232 -0.220044 0.219626 0.226070 -0.210381 0.274754 0.084216 -0.089067 0.541473 -0.370798 0.029445 0.287510 -0.262378 -0.222363 0.251797 -0.205685 0.232835 -0.232256 0.297732 0.102234 -0.083638 0.536118 -0.392377 -0.294866 0.233733 0.227569 0.261101 -0.422944 0.347456 -0.411146 0.345005 0.223790
polarizability: 4.77354151e+02 4.47658262e+00 4.78629751e+02 7.38206011e+00 8.68166577e-01 4.59785404e+02
1716.lowfreq: -3.9714 -1.9328 -0.0015 -0.0010 0.0016 5.6189 16.5491 33.2929 41.1205
frequency: 16.4186 33.2877 41.1107 56.4233 69.0648 74.2924 79.4624 82.2493 87.8241 91.2738 103.1373 106.0863 112.6232 113.8957 117.5309 119.4710 131.4685 134.0856 136.1200 142.1628 145.2296 150.4595 157.2615 163.2816 163.7396 167.9742 174.3899 179.5531 187.2826 189.3288 192.5191 196.0513 203.9109 210.6834 222.9052 230.3335 232.3788 238.3999 241.5700 247.3053 247.6875 252.4414 254.0307 257.6277 265.1017 268.2375 271.4436 277.9427 280.0608 281.4018 286.5435 291.0623 293.2519 301.3978 305.5156 308.7279 313.7889 317.3744 319.5003 331.1927 339.4442 344.4421 362.7121 379.2105 384.8860 389.1012 392.6194 397.8770 400.4508 403.3950 405.1336 407.7530 412.4826 416.4468 425.5600 426.3601 430.6441 433.7292 434.4898 443.1465 453.4660 486.0040 508.7100 581.1374 581.2990 582.1320 644.8000 663.5019 752.0394 763.4811 794.0466 858.6222 859.7491 862.9164 869.9128 889.9313 890.7725 894.5381 936.1994 1014.4072 1015.7983 1017.5382 1022.1675 1029.2259 1029.4957 1030.2591 1053.7829 1054.8898 1055.9548 1059.7521 1062.5337 1065.1840 1071.5599 1072.9317 1074.3657 1077.5349 1104.5171 1105.8700 1108.0545 1117.1816 1123.2659 1124.5744 1125.4017 1127.6835 1130.7400 1132.4619 1179.2550 1179.3629 1188.3309 1188.3435 1190.2768 1211.6695 1214.3231 1216.6580 1216.8573 1217.5273 1257.6444 1258.8078 1262.6570 1306.7835 1308.1430 1310.5302 1317.4282 1324.7749 1325.0724 1325.8097 1331.2887 1371.4997 1372.3737 1373.4907 1401.1216 1401.8751 1409.1000 1433.1571 1437.6256 1445.8645 1447.9397 1448.5992 1449.0989 1450.6252 1452.1986 1453.6868 1466.9321 1468.6073 1469.5875 1474.8547 1476.6062 1485.6255 1485.7722 1487.0578 1490.3226 1490.9153 1491.3468 1493.6234 1494.5758 1495.1962 1496.1946 1499.0876 1499.4366 1499.8436 1501.4069 1502.5806 1503.4737 1505.7446 1506.6857 1508.7897 1509.9794 1510.3476 1510.8113 1682.6034 1837.9965 1860.7996 3034.6916 3037.0890 3038.0931 3040.1124 3041.8141 3041.9119 3042.6078 3044.0823 3044.2487 3047.4211 3050.5733 3053.5618 3063.2447 3063.2955 3091.1399 3096.0107 3096.7209 3109.4968 3110.3237 3113.5497 3124.4317 3126.7467 3135.4442 3140.0038 3140.7213 3146.4550 3156.3826 3158.9947 3161.8302 3168.7772 3180.6110 3183.7211 3187.8059 3191.2622 3193.3845 3193.4695 3418.5358 3440.3594 3462.6918 3467.2398 3473.5896 3477.4954
redmass: 6.1575 4.9248 4.6216 4.9578 4.4103 4.7636 4.3700 3.9169 3.9850 4.1617 4.1165 3.8974 5.6245 4.5692 6.0090 4.4627 6.3017 6.8620 2.9145 1.6850 6.5083 6.7147 4.0109 2.2705 3.7150 2.5122 5.6379 4.9068 5.1540 6.5958 5.2759 6.3727 6.8889 5.6516 4.0691 4.8348 2.3880 3.5787 3.7196 2.5263 5.0934 2.1497 2.4723 2.1383 2.1523 4.1590 2.2870 3.0869 2.5154 2.7411 1.8285 1.5772 2.7359 5.8871 2.6734 3.0950 1.7775 3.2450 3.3165 6.6607 7.6839 9.8615 13.0075 10.5733 8.8228 4.8619 5.9868 2.9161 2.6380 2.7834 2.5498 2.8711 4.0766 3.1825 3.3450 3.6917 4.0846 3.1090 4.5432 3.1057 13.6411 21.6275 27.1466 2.5029 2.5002 2.5269 10.9644 11.0283 7.3551 7.8080 11.4784 1.8246 1.8243 1.8318 7.0515 2.2654 2.2543 2.2555 6.0201 1.4008 1.4313 1.4225 6.9983 1.7589 1.7521 1.7088 1.9726 1.2057 2.2683 7.1319 2.1957 1.4467 1.2325 1.2645 1.2563 1.2045 2.0213 1.9501 1.8825 6.2141 1.6240 1.7224 1.9131 1.6579 1.8056 1.7554 1.2881 1.2872 1.8198 1.8479 1.8872 1.5309 1.8904 1.8239 1.8710 1.6592 1.6041 1.5544 1.5557 1.2439 1.2508 1.2839 5.7360 2.8516 1.5502 1.3100 1.3055 1.2866 1.2779 1.2868 1.2969 1.3139 1.3418 1.3111 1.3003 1.1938 1.1651 1.1646 1.1706 1.2038 1.2054 1.2800 1.2616 1.2510 1.2397 1.2464 1.2300 1.0428 1.0631 1.0434 1.0744 1.0687 1.0721 1.0674 1.0550 1.0485 1.0492 1.0550 1.0561 1.0552 1.0766 1.0752 1.0708 1.0424 1.0422 1.0455 1.0585 1.0508 1.0519 11.8995 12.1058 12.1004 1.0392 1.0499 1.0491 1.0606 1.0448 1.0559 1.0498 1.0410 1.0383 1.0626 1.0616 1.0616 1.0305 1.0305 1.1081 1.1076 1.1073 1.1064 1.1072 1.1078 1.1005 1.0999 1.1026 1.0985 1.0938 1.0953 1.1081 1.1089 1.1070 1.1070 1.1063 1.1061 1.1064 1.1056 1.1092 1.1095 1.0750 1.0752 1.0763 1.0757 1.0761 1.0759
irintensity: 0.8574 0.4907 0.3621 0.4497 2.0960 1.7148 0.8478 2.3162 0.1201 2.7099 1.0499 1.0503 2.0591 2.5336 4.1693 0.4217 0.6721 1.5119 1.3040 1.7628 1.0445 0.7398 0.8279 2.1581 1.4399 0.5190 9.4984 2.2767 1.3235 2.0034 1.2113 4.3109 0.4457 3.7731 1.5549 6.3568 2.4921 4.6579 5.5695 1.1925 1.9899 2.5691 5.5080 2.6406 11.5188 20.4775 11.1881 20.9503 5.0254 0.7124 3.2832 4.9909 1.7627 19.8299 7.1030 13.3696 2.5756 8.7645 7.8268 10.7592 12.5819 1.9112 16.9604 6.2976 10.4704 4.6150 2.1891 1.5507 3.2169 3.2816 4.9571 1.8646 2.1275 4.1065 0.7427 12.6624 11.9132 16.4906 17.2260 7.3557 5.2012 12.7582 26.8346 0.3309 0.2059 0.0288 2.2500 18.5783 17.1407 8.7074 10.5444 7.0982 11.4132 7.1616 14.1557 42.9288 19.5060 25.9160 20.5520 134.2967 96.2019 27.0782 5.0319 27.2003 21.8048 7.7284 16.8070 43.6822 1.1664 83.2181 20.2169 32.0820 62.1599 25.1624 20.1217 19.4666 48.8068 51.6379 35.9248 50.5475 0.7583 0.5340 0.7523 21.6498 20.4076 13.1237 0.9277 1.3592 23.2569 19.6952 19.2799 9.0816 3.6657 4.8289 2.5432 3.2589 15.3456 8.4620 14.7642 16.3234 15.3464 60.4825 542.4707 446.1604 135.2831 13.0190 25.3661 2.3990 2.6158 1.8577 3.8027 1.7032 0.2589 13.0251 7.2881 3.4135 2.3783 14.1467 6.9161 8.4260 1.5943 16.6447 8.6860 11.7244 16.9953 43.0539 35.6151 11.2799 13.2930 10.6171 3.5152 5.7649 10.8798 9.2941 16.0861 11.1158 6.4125 11.4129 10.0839 23.0731 17.4961 12.3098 19.2888 7.8950 8.8780 5.6863 42.2912 47.5621 10.5554 100.9902 206.6203 201.7603 36.9690 3.5957 40.6820 9.1702 43.7664 3.6867 52.3584 24.3733 25.9139 33.7320 28.2878 23.5162 13.2686 28.4770 16.8796 12.9245 14.1231 5.4885 4.9120 5.0519 10.9926 9.3255 6.4619 4.2667 6.3438 8.6056 6.9049 5.4508 3.5143 2.8412 1.1844 0.9531 0.7641 1.9857 6.4028 4.5261 37.8467 23.7749 29.8001 18.8468 21.5122 21.3925
temp: 298.150 k
press: 1.00000 atm
elementType: 6 42 17 42 7 6 42 7 6 6 7 6 16 6 6 8 16 16 17 7 6 7 6 7 6 16 6 6 8 17 6 6 6 8 6 8 6 1 1 1 1 1 1 1 1 1 1 1 1 1 1 1 1 1 1 1 1 1 1 1 1 1 1 1 1 1 1 1 1 1 1 1 1 1 1 1 1 6 1 1
symmnumber: 1
zpe: 1724738.1 jmol-1
zpe.correction: 0.656918 hartree
zpe.thermalcorrener: 0.704647 hartree
zpe.thermalcorrenthalpy: 0.705591 hartree
zpe.thermalcorrgfe: 0.580135 hartree
zpe.sumelectzpe: -2965.028400 hartree
zpe.sumelectthermal: -2964.980671 hartree
zpe.sumelectthermalent: -2964.979727 hartree
zpe.sumelectthermalfe: -2965.105182 hartree
dipole: 2.5225 0.8433 -1.1212
dipole: 2.8864
quadrupole: -268.0837 -261.9213 -279.2793
quadrupole: 12.7245 16.4549 -9.0269
quadrupole: 1.6777 7.8401 -9.5179 12.7245 16.4549 -9.0269
hfenergy: -2965.6853176 hartree
pointgroup: C01 [X(C18H42Cl3Mo3N6O4S4)]
dipole: 0.9873332 0.3472138 -0.4406481 debye
polarizability: 477.3113203|4.3821959|478.700287|7.3615294|1.1454442|459.7576983 unknown
InChI: InChI=1S/C6H6O4S2.3C4H12N2.3ClH.3Mo.2S/c1-9-5(7)3(11)4(12)6(8)10-2;3*1-5-3-4-6-2;;;;;;;;/h1-2H3;3*5-6H,3-4H2,1-2H3;3*1H;;;;;/q;;;;;;;3*+1;;/p-3
charge 1 multiplicity 1
80 atoms
C  -2.57785215 3.38284509 1.34976256
Mo -0.74496527 1.44668364 -0.59166093
Cl -2.7059777 2.26256667 -1.84863293
Mo -1.15573513 -1.16400236 -0.80135861
N  -0.87231694 -2.8330761 -2.36357355
C  0.46813048 -3.19701403 -2.86680801
Mo -0.17609372 -0.16549114 1.61356641
N  1.43510773 -0.66197903 3.23528109
C  1.05176475 -1.91631877 3.91674949
C  -0.42165176 -1.85445207 4.25959666
N  -1.21439496 -1.67817627 3.02462618
C  -2.62896234 -1.4229914 3.38812894
S  0.95712279 -1.87255996 0.39000576
C  2.36728363 -0.9979061 -0.33849526
C  3.38237816 -1.89029207 -1.00836123
O  3.26129182 -2.3323968 -2.12338812
S  0.01610666 0.10981251 -2.27438664
S  -2.27643195 0.239926 0.74852476
Cl -2.24475042 -3.11868499 0.29584717
N  -3.08440111 -1.0636484 -1.99922395
C  1.42255651 3.05124657 -2.53355426
N  0.19923193 3.22506576 -1.72514857
C  -0.89491367 4.52105078 0.03444659
N  -1.21920568 3.26914265 0.75705478
C  -4.38401905 -0.88246518 -1.30419691
S  1.39837186 1.35625467 0.70397352
C  2.55815076 0.31822249 -0.21425291
C  3.81636182 0.93442672 -0.74934441
O  4.60245463 0.35416312 -1.46248489
Cl -0.6604461 1.50895875 3.45216538
C  -3.17001837 -2.23194998 -2.91176131
C  -1.80374097 -2.56671013 -3.47867297
C  2.88435119 -0.6634781 2.94797096
O  3.98161711 2.19843052 -0.34396942
C  5.18164542 2.83229164 -0.82351926
O  4.38207949 -2.16683557 -0.17464099
C  5.47870346 -2.88041141 -0.77678604
H  -1.39889409 -1.72664455 -4.06410976
H  -1.87140109 -3.43977181 -4.14711505
H  -4.46463508 -1.62991007 -0.50472116
H  -5.21030514 -1.01276301 -2.01826502
H  -4.43312587 0.12601949 -0.88258649
H  -0.79814002 5.35883252 0.7415828
H  -1.74512028 4.73596443 -0.63103894
H  3.12199254 -1.44633746 2.21592743
H  3.45435449 -0.8610376 3.86841757
H  3.18743542 0.31005662 2.54649243
H  -3.32233915 3.30348524 0.54868724
H  -2.68148487 4.35253794 1.85927095
H  -2.71990961 2.58418249 2.08360424
H  0.95572088 -2.32299227 -3.31268314
H  0.39126479 -3.99502993 -3.62119703
H  1.08944855 -3.5440205 -2.03662329
H  -2.72233147 -0.38839914 3.74259097
H  -2.94965031 -2.11532981 4.18161041
H  -3.26343543 -1.57798971 2.50895798
H  1.65779782 -2.06397827 4.82486919
H  1.2638028 -2.75092927 3.22930342
H  5.16607371 2.87522957 -1.91993504
H  6.05907531 2.26056373 -0.49993201
H  5.18551453 3.83502131 -0.38931261
H  6.21595199 -3.0239479 0.01678588
H  5.88864849 -2.27124617 -1.59236048
H  5.1318836 -3.84282142 -1.17061084
H  -2.93305145 -0.21532082 -2.55963133
H  -3.89403248 -2.03201068 -3.71577768
H  -3.54873948 -3.07463726 -2.31348516
H  -0.57120822 3.46264426 -2.35815901
H  -1.20158044 -2.55761961 2.49795447
H  -0.57891533 3.15949702 1.55518989
H  -1.23589773 -3.6372135 -1.84318932
H  1.24183477 0.11472412 3.87641342
H  2.23596927 2.726086 -1.87420302
H  1.71048261 4.00198901 -3.00814409
H  1.26032308 2.29742094 -3.31025688
H  -0.73904857 -2.76082366 4.79842212
H  -0.6241317 -0.98521897 4.90354796
C  0.37241011 4.35158341 -0.78040321
H  0.60447108 5.28081829 -1.32508132
H  1.23183605 4.11399124 -0.13419056
