program: Gaussian 09
title: 000032637
version: EM64L-G09RevD.01
frameworkgroup: C1[X(C10H10Cl6N4)]
method: RPBEPBE
basis: SDD
operation: Freq
keyword: #p
keyword: freq=noraman
keyword: PBEPBE/SDD
title: #p freq=noraman PBEPBE/SDD
converged: NO YES NO NO
title: Mulliken charges:
elementType: Cl Cl Cl Cl Cl Cl N N N N C C C C C C C C C C H H H H H H H H H H
charge: 0.114814 0.122217 0.117185 0.117615 0.121944 0.114355 -0.102354 -0.043436 -0.043484 0.070550 -0.404944 -0.378561 -0.378309 -0.401622 -0.402091 0.096770 0.274520 0.274715 -0.777824 -0.777498 0.229778 0.195012 0.213463 0.215882 0.215547 0.213489 0.217520 0.283482 0.283585 0.217679
chargesum: 0.00000
title: Mulliken charges with hydrogens summed into heavy atoms:
elementType: Cl Cl Cl Cl Cl Cl N N N N C C C C C C C C C C
charge: 0.114814 0.122217 0.117185 0.117615 0.121944 0.114355 -0.102354 -0.043436 -0.043484 0.070550 0.019845 0.050784 0.050726 0.099381 0.099174 0.096770 0.274520 0.274715 -0.777824 -0.777498
polarizability: 2.57025498e+02 6.10948830e-01 1.95660190e+02 3.95233887e+00 -1.16490350e-01 1.50623026e+02
1716.lowfreq: 0.0021 0.0021 0.0025 1.6876 8.0847 9.1858 15.3441 15.7819 43.1429
frequency: 15.1524 15.5097 43.1209 55.6996 62.6853 79.0532 83.9012 117.5558 147.5011 154.5555 178.7293 186.5611 191.1693 217.3749 222.8247 252.1383 260.2281 274.0887 282.3205 291.5714 309.3653 359.8367 362.9854 390.1738 401.3232 416.7719 440.0886 495.2761 552.4338 590.5784 606.8600 648.6353 661.1115 701.2992 745.4099 760.1934 768.0396 772.7209 803.7832 818.1802 832.3188 848.7540 866.3775 902.9441 904.8010 948.3875 990.5556 1001.3238 1031.0629 1070.8872 1087.7118 1120.1208 1153.9010 1155.3002 1179.2604 1233.4747 1253.6047 1267.5834 1276.1594 1310.7551 1329.0226 1338.5648 1345.9218 1347.1564 1353.0053 1363.9882 1412.4323 1458.3634 1463.8580 1466.7806 1471.6712 1477.4875 1499.0016 1575.1489 2973.4399 2974.2944 2977.6914 2993.0772 2993.6032 3044.9175 3054.4500 3062.2008 3105.1336 3106.5084
redmass: 33.2663 17.5911 5.1108 3.7974 9.9370 20.2868 4.9667 14.2591 8.0427 18.7740 23.1706 3.1757 8.2211 18.4171 21.4357 23.4228 3.2610 3.8089 15.3238 7.2972 7.5792 7.9192 9.3945 6.0187 2.3547 9.0603 3.0339 2.4953 7.1449 2.6246 13.4552 11.8762 12.8528 7.2643 11.8258 10.6253 12.1832 11.2991 1.4942 3.6974 11.5601 1.4749 4.2835 9.3789 2.5635 1.3141 2.8436 10.0563 2.4334 2.5723 1.4248 2.8637 2.4299 1.3081 4.9433 2.8236 1.3072 1.9945 1.1900 3.0216 1.2741 1.4245 1.4513 1.9679 3.1599 1.4080 11.6073 1.0904 1.0917 1.0903 1.0757 1.1054 10.1687 6.6643 1.0646 1.0691 1.0696 1.0616 1.0608 1.0962 1.1022 1.1031 1.0942 1.0953
irintensity: 0.0015 0.0307 0.0348 0.0289 0.1070 0.0819 0.4237 0.0011 1.7458 0.7171 0.3675 1.7376 2.6630 0.0346 0.0503 0.2791 1.4900 0.0032 0.0042 1.8314 1.6539 0.3723 0.0352 0.1291 5.0596 1.0926 0.0010 3.7634 12.4676 6.9283 0.0249 152.7750 116.9015 97.7442 151.0613 71.4159 0.7533 65.1381 1.3327 13.3012 7.6613 24.8983 80.9776 4.4807 1.0067 5.8831 15.4854 68.8434 22.5732 1.9956 0.0649 2.0874 2.0667 0.3023 27.1557 2.0243 22.4693 136.6475 4.2158 2.8307 0.9012 2.4368 2.2726 0.6794 1.2741 8.9359 295.3382 5.2069 33.8318 36.0460 7.9163 21.3761 275.9260 720.3774 27.0737 9.9114 77.5993 23.6986 27.5916 52.9808 25.2909 78.2321 2.7404 4.0911
temp: 298.150 k
press: 1.00000 atm
elementType: 17 17 17 17 17 17 7 7 7 7 6 6 6 6 6 6 6 6 6 6 1 1 1 1 1 1 1 1 1 1
symmnumber: 1
zpe: 516546.4 jmol-1
zpe.correction: 0.196742 hartree
zpe.thermalcorrener: 0.217174 hartree
zpe.thermalcorrenthalpy: 0.218118 hartree
zpe.thermalcorrgfe: 0.143758 hartree
zpe.sumelectzpe: -3364.904859 hartree
zpe.sumelectthermal: -3364.884427 hartree
zpe.sumelectthermalent: -3364.883483 hartree
zpe.sumelectthermalfe: -3364.957844 hartree
dipole: -7.2959 -0.0811 -0.4759
dipole: 7.3118
quadrupole: -140.6988 -166.8539 -155.4261
quadrupole: 0.3151 0.8330 -0.0351
quadrupole: 13.6275 -12.5276 -1.0999 0.3151 0.8330 -0.0351
hfenergy: -3365.1016015 hartree
pointgroup: C01 [X(C10H10Cl6N4)]
dipole: -2.8592666 0.0299093 -0.3146929 debye
polarizability: 256.461169|-0.8484296|195.4356717|8.6730794|3.1189272|151.4118726 unknown
InChI: InChI=1S/C10H10Cl6N4/c11-9(12,13)6-17-7(10(14,15)16)19-8(18-6)20-4-2-1-3-5-20/h1-5H2
charge 0 multiplicity 1
30 atoms
Cl 2.747558 -2.624854 1.651952
Cl 0.87897 -3.941147 -0.315327
Cl 3.26753 -2.40652 -1.328458
Cl 3.288745 2.567557 -0.938484
Cl 0.890035 3.942881 0.261949
Cl 2.731911 2.342466 2.035162
N  -2.162566 0.044019 -0.560786
N  -0.168086 1.231845 -0.117362
N  -0.172764 -1.201628 -0.289514
N  1.890275 -0.013173 0.143206
C  -4.959856 0.008919 0.255738
C  -4.080478 1.268405 0.442107
C  -4.093217 -1.272182 0.288519
C  -2.938381 1.309046 -0.598589
C  -2.949377 -1.200725 -0.749858
C  -0.824195 0.02454 -0.319666
C  1.154777 1.137408 0.104223
C  1.151233 -1.143756 -0.061646
C  1.942624 -2.459546 -0.021177
C  1.947937 2.430212 0.346161
H  -5.737875 -0.035373 1.039904
H  -5.488033 0.070532 -0.718309
H  -4.686888 2.187663 0.338996
H  -3.643395 1.275501 1.459324
H  -3.656957 -1.405721 1.2973
H  -4.708361 -2.166476 0.07583
H  -3.362847 1.417544 -1.617662
H  -2.244057 2.142197 -0.415942
H  -2.26239 -2.055802 -0.667507
H  -3.372475 -1.184635 -1.775284
