program: Gaussian 09
title: 1Ni OH
version: ES64L-G09RevE.01
frameworkgroup: C1[X(C14H26N4NiO2)]
method: UTPSSh
basis: Gen
operation: Freq
keyword: #P
keyword: Geom=AllCheck
keyword: Guess=TCheck
keyword: SCRF=Check
keyword: GenChk
keyword: UTPSSh/ChkBas
keyword: Freq
converged: YES YES NO YES
polarizability: 4.07827454e+02 -3.72498151e+00 3.43531492e+02 -1.78673963e+00 -1.32199995e+01 3.14305226e+02
1716.lowfreq: -15.7307 -0.0009 0.0003 0.0007 8.5321 14.0448 55.3130 81.0060 120.9076
frequency: 55.0604 80.9418 120.6831 128.8242 157.2399 183.8215 203.0455 214.5370 236.7746 245.0372 250.7949 262.6479 267.7140 275.8556 282.7993 300.3116 306.8969 312.3657 318.7204 343.5505 359.2250 366.3972 382.6162 407.0289 428.0177 434.5478 438.3920 442.7096 470.2691 474.6600 490.4063 519.8669 525.3935 552.0664 560.2386 580.9919 611.6691 624.8435 654.7057 661.0139 718.9419 735.4651 760.6807 773.2480 820.5693 841.7068 856.2900 897.4169 907.6788 935.2257 944.5290 959.2166 974.2915 977.7476 985.0751 1003.9156 1006.1673 1023.3070 1029.6569 1036.6594 1040.5557 1057.0436 1062.9207 1072.1897 1079.2783 1090.8313 1098.2662 1128.0014 1141.1410 1157.9132 1166.2504 1179.5801 1182.8485 1218.9212 1233.6865 1243.6867 1266.5746 1280.9658 1290.7848 1298.9021 1310.0133 1320.6362 1321.4111 1329.8521 1334.6137 1370.0209 1382.6033 1393.2301 1408.0707 1416.4432 1431.7679 1436.2696 1452.3777 1468.5899 1474.8293 1476.8510 1479.4038 1480.9236 1489.3815 1503.6471 1505.2140 1510.9695 1513.6376 1515.4163 1519.5347 1537.7287 1546.5555 1616.8383 1646.0876 3063.0212 3068.4168 3085.3974 3086.9488 3091.8926 3097.5205 3107.7825 3110.6244 3121.2634 3155.8890 3156.5659 3157.0906 3159.5129 3163.5469 3174.3429 3184.1558 3194.3334 3198.5541 3199.8837 3209.7182 3228.1013 3239.0010 3243.2573 3252.1110 3708.4003 3794.3580
redmass: 4.2144 3.3553 3.9469 4.3060 3.2191 3.2251 2.5910 3.4742 4.0997 3.4986 3.5841 2.7275 1.9726 2.1162 2.1102 2.7406 2.5855 1.6681 1.9824 3.0426 3.0734 3.6647 4.0739 2.5438 2.3859 3.5421 2.5668 2.5432 2.9131 2.8940 3.3159 1.8844 1.7172 5.1643 7.2362 3.9587 4.0773 3.9884 3.6638 6.1121 3.3075 1.8895 2.2094 1.2879 2.7074 4.0003 1.7617 1.3365 1.9867 2.8065 1.1487 2.1524 1.9862 2.6698 1.4954 2.4374 2.8080 2.2413 1.3408 5.0077 4.6669 1.3890 1.9028 2.0762 2.2330 1.7453 1.9573 1.5287 1.6032 1.4753 1.7472 1.1058 1.7120 1.8700 1.9479 1.5819 1.4678 1.3636 1.3753 1.5417 1.3672 1.3096 4.3492 1.4128 1.3201 1.2685 1.2849 1.3089 1.3138 1.3526 1.2810 1.2896 1.1561 1.0869 1.0983 1.1518 1.0597 2.0967 1.0692 1.0812 1.0859 1.0827 1.0564 2.3393 1.0854 1.0533 1.0809 6.0248 5.8707 1.0406 1.0380 1.0684 1.0643 1.0613 1.0587 1.0667 1.0677 1.0609 1.1070 1.0982 1.1035 1.1027 1.0943 1.1073 1.1036 1.0998 1.1079 1.0962 1.1073 1.0892 1.0904 1.0960 1.0991 1.0659 1.0660
irintensity: 3.7037 1.3319 2.6302 23.9649 4.5321 8.5151 3.9152 10.8399 17.0857 3.3772 6.3463 3.3381 9.0724 18.5192 42.6254 29.8752 11.4815 84.8695 16.4098 7.8696 1.1181 21.8769 22.8702 1.8024 4.8030 9.5176 1.2958 4.6306 6.0558 20.7307 5.0672 50.0916 192.4524 59.3393 94.5752 81.1630 3.5055 2.3125 4.9625 3.1041 19.8780 9.7310 61.6605 59.1018 41.2165 22.7716 0.2719 0.9420 8.1585 8.8031 175.8504 1.8754 3.6940 7.6238 5.0049 15.0018 19.3014 2.1322 0.1461 5.3776 17.3263 90.8962 64.3167 47.9414 64.3221 33.0189 19.6976 1.1154 37.0824 3.5854 29.0071 1.6605 11.2059 2.4081 6.1429 6.4473 25.9983 1.1798 11.1295 47.4993 28.2619 17.6923 0.7589 67.1706 8.9289 0.9065 8.2521 14.7149 18.4135 1.7561 6.1648 6.3602 9.2456 22.5125 6.0486 11.0792 24.5721 16.1734 8.7918 1.5586 4.0531 51.3616 27.3236 61.9516 1.9559 23.9549 19.2712 7.8287 14.6047 8.2204 11.0732 10.2369 11.9145 17.0909 4.4352 5.0016 14.6606 15.6802 1.5481 7.5528 2.8368 1.9297 4.5436 1.1574 5.4616 2.8690 9.6232 20.7115 5.2481 2.8972 0.8929 0.4455 2.1634 156.8415 79.8096
temp: 298.150 k
press: 1.00000 atm
elementType: 28 7 6 6 6 6 1 6 1 1 7 7 6 1 1 6 1 1 6 1 1 6 1 1 6 1 1 1 6 1 1 6 1 1 7 6 1 1 1 6 1 1 8 1 8 1 1
symmnumber: 1
zpe: 1085344.4 jmol-1
zpe.correction: 0.413386 hartree
zpe.thermalcorrener: 0.433191 hartree
zpe.thermalcorrenthalpy: 0.434135 hartree
zpe.thermalcorrgfe: 0.369073 hartree
zpe.sumelectzpe: -1087.236368 hartree
zpe.sumelectthermal: -1087.216563 hartree
zpe.sumelectthermalent: -1087.215619 hartree
zpe.sumelectthermalfe: -1087.280681 hartree
dipole: 0.7636 0.1569 9.3475
dipole: 9.3799
quadrupole: -55.4988 -89.5520 -110.9715
quadrupole: -3.6876 4.2013 -3.9034
quadrupole: 29.8419 -4.2112 -25.6307 -3.6876 4.2013 -3.9034
hfenergy: -1087.649754 hartree
pointgroup: C01 [X(C14H26N4Ni1O2)]
dipole: -0.2336339 -0.4075796 3.6603295 debye
polarizability: 407.4695178|-6.1219523|341.0951227|-0.0179302|15.8777376|317.0995314 unknown
InChI: InChI=1S/C14H24N4.Ni.2H2O/c1-16-7-8-17(2)10-12-18(11-9-16)13-14-5-3-4-6-15-14;;;/h3-6H,7-13H2,1-2H3;;2*1H2/q-1;+3;;/p-2
charge 2 multiplicity 1
47 atoms
Ni -0.34017659 -0.03392523 -0.42057935
N  1.61666774 -0.14005271 -0.35160803
C  2.15470139 0.9368358 0.27295819
C  2.40722217 -1.10019859 -0.86549052
C  3.53296108 1.0512295 0.43363979
C  3.79172414 -1.02834439 -0.75218999
H  1.92999336 -1.92596574 -1.37705834
C  4.3619201 0.05672415 -0.08572199
H  3.93561947 1.91394288 0.95156786
H  4.39718904 -1.81802736 -1.1804528
N  -0.15360859 1.38168736 0.96330166
N  -0.59038201 -1.38077149 1.05683256
C  -2.08039474 -1.55026593 1.16846451
H  -2.32067771 -1.95997595 2.15462617
H  -2.36102009 -2.27868255 0.40613388
C  1.17861932 2.00094345 0.66560002
H  1.0474531 2.67149977 -0.18644417
H  1.51807817 2.58010407 1.52785661
C  0.08477484 -0.76278676 2.24579855
H  1.15080957 -0.96659782 2.13782163
H  -0.26929676 -1.25976455 3.15535131
C  -0.17377918 0.72987691 2.33563082
H  -1.13722996 0.93709088 2.79383445
H  0.59402115 1.19951027 2.95524259
C  -0.0048422 -2.73796816 0.85935919
H  1.07593753 -2.66760913 0.74126519
H  -0.22796787 -3.33473413 1.75104123
H  -0.45904502 -3.21536701 -0.00821493
C  -1.27726946 2.38866802 0.81008546
H  -0.85771705 3.3358504 0.47195585
H  -1.72095194 2.54734333 1.79300758
C  -2.81009682 -0.24846566 0.93033499
H  -3.87765007 -0.43993875 0.78836122
H  -2.71083434 0.44601348 1.76169195
N  -2.27774629 0.40696352 -0.31411047
C  -3.03628878 -0.02121268 -1.51571444
H  -3.09527772 -1.10706641 -1.54646009
H  -4.04238051 0.40643182 -1.44053303
H  -2.53571313 0.35816089 -2.40577488
C  -2.30993491 1.89984623 -0.20769522
H  -2.09248944 2.2895254 -1.19894949
H  -3.32315834 2.1965334 0.08449046
O  -0.13209724 1.24365273 -1.7505424
H  -0.07826851 0.6585987 -2.53033481
O  -0.62147719 -1.27740841 -1.76304268
H  -0.02686317 -2.03464683 -1.63482367
H  5.4381908 0.13064353 0.0256671
