program: Gaussian 09
title: 1Fe OH
version: ES64L-G09RevE.01
frameworkgroup: C1[X(C14H25N4NiO2)]
method: UTPSSh
basis: Gen
operation: Freq
keyword: #P
keyword: Geom=AllCheck
keyword: Guess=TCheck
keyword: SCRF=Check
keyword: GenChk
keyword: UTPSSh/ChkBas
keyword: Freq
converged: YES YES NO YES
polarizability: 3.79329309e+02 -2.83468233e+00 3.62784449e+02 -6.81598508e-01 3.45819359e+01 3.60390233e+02
1716.lowfreq: -22.1449 -6.9996 0.0005 0.0010 0.0011 21.3599 56.7418 84.9613 86.2960
frequency: 56.3406 84.9513 86.2292 90.0107 122.1278 126.6993 150.9980 162.2880 179.2792 190.3261 199.9658 204.9220 218.4254 228.4213 242.8100 260.1502 270.0724 277.9703 285.0140 314.7247 325.9618 347.9009 374.3665 379.8077 399.8215 405.9804 419.2380 421.9809 427.8700 451.0003 461.4148 475.5250 484.6333 520.1312 548.3945 602.3149 611.1189 641.7972 649.1888 735.9944 740.7551 763.4911 777.4426 816.8914 838.5232 854.9651 893.3236 896.0077 912.5533 925.6261 971.7450 984.4806 991.6424 1000.5982 1010.0721 1014.9138 1026.7078 1030.5618 1034.1418 1035.4751 1065.4789 1077.4531 1082.7866 1086.7714 1098.6202 1133.4955 1138.1943 1153.9982 1158.6791 1177.7112 1181.1497 1223.7980 1241.0381 1245.2392 1266.9814 1272.1939 1285.9053 1301.4904 1314.2984 1319.8837 1325.1902 1331.8349 1345.3789 1373.4781 1385.6973 1396.9206 1400.8877 1414.0668 1423.5642 1434.2160 1464.9179 1475.4237 1479.5529 1486.7617 1488.8597 1497.3988 1500.7778 1504.0567 1506.4152 1509.0813 1510.8161 1521.8109 1522.0770 1524.5879 1554.4553 1617.8492 1646.7263 3049.0104 3051.1071 3055.5020 3060.5267 3066.1678 3067.8568 3081.3273 3094.4606 3104.3024 3119.1828 3124.5131 3136.8038 3142.1740 3143.0679 3145.2542 3159.2355 3170.9380 3181.7163 3183.8111 3187.1903 3221.1650 3234.0269 3238.2202 3250.0025 3665.4007
redmass: 4.8178 4.9607 6.2738 7.2369 5.6624 7.3972 3.1915 3.5948 3.9039 3.7537 4.3314 3.0584 3.6535 4.8156 4.5085 6.8191 3.0650 1.2665 1.1645 2.9706 2.5093 3.9522 3.3215 3.3975 1.7453 2.0054 2.5214 3.1571 2.3214 2.4488 2.2856 3.2952 8.5153 2.6919 2.8424 3.6699 3.7048 3.9056 6.3941 3.5944 1.9826 2.3281 1.2693 2.5910 3.3105 1.6678 2.0879 1.1302 1.3006 2.6441 2.0954 1.7632 1.7366 2.4556 2.4483 2.6578 6.1854 1.3403 3.0866 2.7470 2.0468 2.1733 2.3664 2.4101 2.4277 1.5933 1.4928 1.3996 1.6503 1.1109 1.9680 1.9391 1.8428 1.8701 1.3800 1.2857 1.3413 1.5732 1.3698 1.5268 2.7156 1.3584 1.3728 1.3035 1.2784 1.3064 1.3189 1.3573 1.2856 1.2371 1.1506 1.1513 2.1235 1.1045 1.0848 1.0622 1.0759 1.0642 1.0613 1.0650 1.0692 1.6473 1.1440 1.1467 1.0808 5.8674 5.4574 1.0406 1.0408 1.0614 1.0671 1.0631 1.0582 1.0707 1.0676 1.0616 1.1038 1.1071 1.1017 1.0941 1.0946 1.0968 1.1084 1.0993 1.1066 1.1054 1.0933 1.0889 1.0921 1.0936 1.0977 1.0666
irintensity: 2.1045 2.5817 3.0660 3.8698 2.1302 3.1416 12.1132 3.5250 18.7116 0.5166 0.9633 1.9388 1.1706 2.9112 2.8421 9.2816 0.5049 16.3861 17.6152 9.4248 5.8589 42.3291 1.8537 11.5446 65.2265 6.4834 1.4986 1.9239 0.7391 25.1220 17.1731 14.8007 14.6709 6.5461 2.9592 4.2300 0.2732 1.5870 1.3118 11.6917 7.6680 27.8284 70.1943 26.6697 18.3092 4.8763 3.8908 246.6855 3.5382 16.5764 4.3472 0.8812 8.5492 15.1786 17.7365 69.4348 3.8658 0.9611 8.1694 19.3190 59.1788 22.9450 48.9592 27.7365 23.3184 17.1989 6.3561 25.5531 32.9030 3.5801 24.1241 0.8781 6.2368 2.1101 10.1188 4.8995 26.3906 37.3841 19.0962 23.3009 4.9462 11.5884 49.5176 3.4455 0.1415 3.3241 11.3999 7.9619 9.0066 13.4177 13.6524 21.9717 45.7813 11.0212 11.0842 5.1356 9.0378 22.1516 25.4905 15.7817 40.6568 40.5027 7.9971 18.0383 11.5693 7.9314 35.7494 39.8282 46.5311 38.4680 49.2887 32.8978 13.6439 43.4444 32.7368 36.9411 13.5385 7.4696 4.5452 6.8315 8.0451 4.7776 6.1606 12.1844 11.2797 20.1773 37.7001 2.6949 1.5022 3.0520 7.5816 474.5483
temp: 298.150 k
press: 1.00000 atm
elementType: 28 7 6 6 6 6 1 6 1 1 7 7 6 1 1 6 1 1 6 1 1 6 1 1 6 1 1 1 6 1 1 6 1 1 7 6 1 1 1 6 1 1 8 8 1 1
symmnumber: 1
zpe: 1042886.6 jmol-1
zpe.correction: 0.397215 hartree
zpe.thermalcorrener: 0.418384 hartree
zpe.thermalcorrenthalpy: 0.419328 hartree
zpe.thermalcorrgfe: 0.348707 hartree
zpe.sumelectzpe: -1086.522323 hartree
zpe.sumelectthermal: -1086.501153 hartree
zpe.sumelectthermalent: -1086.500209 hartree
zpe.sumelectthermalfe: -1086.570831 hartree
dipole: -0.3242 -0.3464 5.0173
dipole: 5.0397
quadrupole: -64.6417 -86.9186 -113.0385
quadrupole: -4.2152 -3.1114 4.5126
quadrupole: 23.5579 1.2810 -24.8389 -4.2152 -3.1114 4.5126
hfenergy: -1086.9195377 hartree
pointgroup: C01 [X(C14H25N4Ni1O2)]
dipole: -0.1580878 -0.4691705 1.9199607 debye
polarizability: 379.1481436|-3.7952341|351.1994995|-0.1192296|32.9365691|372.1563471 unknown
InChI: InChI=1S/C14H24N4.Ni.H2O.O/c1-16-7-8-17(2)10-12-18(11-9-16)13-14-5-3-4-6-15-14;;;/h3-6H,7-13H2,1-2H3;;1H2;/q-1;+2;;/p-1
charge 2 multiplicity 6
46 atoms
Ni -0.37063991 -0.1314005 -0.62674575
N  1.75240745 -0.16757276 -0.45263287
C  2.21440559 0.91056461 0.21998382
C  2.60598288 -1.12887753 -0.85103092
C  3.56668972 1.04281127 0.53341197
C  3.97021577 -1.05318647 -0.58350348
H  2.18194134 -1.96701265 -1.39241106
C  4.45581575 0.04797061 0.12410228
H  3.90574716 1.91191985 1.08596217
H  4.62736345 -1.84634321 -0.92016972
N  -0.12190427 1.36898968 0.8867314
N  -0.62529833 -1.43800179 1.04615886
C  -2.10621008 -1.53147294 1.23978835
H  -2.32164715 -1.89965542 2.25003169
H  -2.45878804 -2.27255083 0.51891009
C  1.19627651 1.9749657 0.54200827
H  1.0534006 2.59529214 -0.3489328
H  1.54572306 2.61423772 1.35907916
C  0.12966559 -0.79734788 2.16084021
H  1.18358616 -1.02235938 1.98781764
H  -0.16165178 -1.25683101 3.11405015
C  -0.087157 0.70973722 2.24259284
H  -1.01869336 0.93533316 2.75818629
H  0.72222283 1.15298334 2.83104475
C  -0.08836628 -2.81206199 0.84805754
H  0.98007429 -2.76174991 0.63660063
H  -0.2440054 -3.40175194 1.75990606
H  -0.60750544 -3.28984468 0.01639992
C  -1.25172783 2.35618062 0.76024609
H  -0.85710526 3.31085137 0.40790465
H  -1.67406034 2.52423415 1.7521348
C  -2.83317468 -0.21361509 1.00049579
H  -3.91169889 -0.40501067 0.97664244
H  -2.65435449 0.50090991 1.80171771
N  -2.41047121 0.3970121 -0.29389572
C  -3.28609678 -0.03721173 -1.40871401
H  -3.33255078 -1.12643041 -1.42819724
H  -4.29471882 0.36701466 -1.26015737
H  -2.87886862 0.32801838 -2.35260242
C  -2.33134312 1.88162834 -0.22833277
H  -2.10088475 2.22726546 -1.23922163
H  -3.30537153 2.29407061 0.06332078
O  -0.18400703 0.98672448 -2.04238705
O  -0.75244611 -1.52945047 -1.91479212
H  0.00207955 -2.1482827 -2.03064079
H  5.51234484 0.13108479 0.3565239
