program: Gaussian 09
title: 1Fe OH
version: ES64L-G09RevE.01
frameworkgroup: C1[X(C14H27FFeN4O2)]
method: UTPSSh
basis: Gen
operation: Freq
keyword: #P
keyword: Geom=AllCheck
keyword: Guess=TCheck
keyword: SCRF=Check
keyword: GenChk
keyword: UTPSSh/ChkBas
keyword: Freq
converged: YES YES NO YES
polarizability: 3.81038640e+02 3.90994613e-01 3.32121132e+02 1.33267880e+01 -4.56985273e+00 2.82311726e+02
1716.lowfreq: 0.0012 0.0014 0.0016 16.0446 39.8757 51.3808 75.9923 98.8834 106.8076
frequency: 60.0646 94.1382 106.2650 148.2666 153.6139 172.2624 177.5749 183.5182 201.1737 213.7770 214.7350 231.3385 234.3879 245.5411 253.6513 258.6029 265.8407 276.9913 287.2566 307.7996 313.8091 326.2562 336.1582 346.2102 368.1595 373.2770 384.2738 392.9143 409.7777 424.1286 436.9785 447.7241 461.5509 471.8628 480.7159 488.8373 519.8547 533.8598 552.6147 566.6224 570.7921 593.3157 610.3795 621.9731 653.3040 694.5513 735.3799 741.1976 757.4164 770.2191 805.1051 823.2714 864.5166 901.6830 916.4411 929.8206 979.6986 987.4209 1002.8481 1015.5273 1019.6704 1023.4911 1024.8377 1032.5492 1038.9367 1042.4489 1070.2657 1085.0299 1089.3461 1102.1474 1103.7555 1145.1603 1155.9763 1168.0543 1178.1110 1187.8018 1230.9532 1244.2737 1249.3662 1271.2145 1276.1718 1286.4564 1290.4757 1316.0502 1324.6686 1335.7779 1345.2360 1349.1110 1385.5153 1395.4966 1403.9636 1410.8362 1421.0929 1437.4319 1444.7365 1462.0652 1471.0447 1472.1541 1489.8412 1497.5194 1500.6536 1503.7942 1506.4199 1510.3892 1512.5805 1517.5052 1519.7502 1522.1314 1532.5570 1568.4404 1613.8326 1627.1853 1659.5140 1670.3451 3053.0339 3055.0519 3064.3950 3065.5241 3068.7968 3079.8194 3090.4101 3096.1769 3107.2807 3134.2645 3136.5945 3144.7895 3145.4819 3148.3010 3150.2154 3162.3592 3176.5129 3185.3438 3186.7527 3194.2410 3232.4291 3246.9849 3258.4845 3728.3112 3734.7981 3821.9917 3833.3516
redmass: 4.7921 6.4355 4.2378 3.8068 4.2467 4.1087 4.8570 3.9797 4.6195 2.7690 2.9653 2.3544 2.4155 2.9180 2.8263 1.4548 2.3020 5.5056 3.0023 3.0472 2.4515 2.1629 2.3617 2.6480 3.1584 3.6330 1.9410 3.2557 2.2424 2.2630 2.7212 2.6290 3.8297 3.2660 2.4231 1.2336 2.8224 1.1286 2.7474 5.9210 1.3195 3.7792 3.1546 3.8516 3.7063 1.0503 3.7691 2.0177 4.1843 2.4954 1.6560 2.1269 1.6283 2.0800 1.3726 2.6470 2.2062 2.6032 2.4712 2.5895 3.2578 2.5408 1.3593 7.0088 3.7032 2.2098 1.9957 2.1860 2.5506 2.3779 1.5862 1.5149 1.4246 1.7544 1.1645 2.0139 1.8461 1.5802 1.8822 1.3719 1.3234 2.2145 1.5309 1.5073 1.3617 1.4412 2.7668 1.2759 1.2770 1.3251 1.3504 1.3457 1.3887 1.2855 1.2528 2.7175 1.1531 1.1356 1.0849 2.0634 1.0569 1.0721 1.2147 1.0945 1.0682 1.1021 1.0778 1.0845 1.0765 1.0792 4.7447 1.1444 7.1700 1.0780 1.0398 1.0417 1.0667 1.0667 1.0629 1.0600 1.0696 1.0690 1.0610 1.1048 1.1032 1.1000 1.0985 1.0958 1.0931 1.1058 1.0991 1.1071 1.0962 1.1064 1.0903 1.0953 1.0970 1.0448 1.0458 1.0822 1.0805
irintensity: 4.5157 2.6086 6.4327 5.3009 14.7376 2.0541 1.7644 11.9632 1.2580 0.7693 7.4667 1.0226 19.5106 15.9980 31.6709 8.9389 0.6920 17.0201 19.7228 31.1723 31.1009 42.7684 47.3101 41.7321 84.5499 167.4062 25.8329 1.0057 6.7407 43.6835 5.2567 22.7185 3.9547 15.5016 25.9213 469.3132 11.9350 100.9285 20.1880 9.4519 123.7879 0.4938 11.1544 6.9817 1.5216 45.1004 4.6250 15.2875 34.8717 11.7122 52.6306 68.8836 0.2333 2.8916 3.5146 21.9866 6.7227 7.5182 9.2237 17.6804 121.3925 11.7978 1.7796 30.9039 17.3936 5.2407 71.3129 37.1690 88.1110 30.7433 15.0183 1.6446 14.5029 57.0674 5.3705 10.1211 5.7334 15.9049 2.2979 62.2991 8.4349 111.0678 77.8674 38.2350 26.0700 10.5447 20.7007 15.7173 2.2070 6.1565 20.5128 25.0974 7.6870 4.2376 14.3982 82.5248 6.3178 6.3950 5.1199 203.2828 17.9134 10.7346 22.5892 28.9886 46.0592 3.7334 21.6937 16.5761 3.2045 32.4301 131.1715 117.6697 233.7921 140.4666 23.8995 24.2926 34.4378 23.7401 26.5818 14.1131 26.9533 25.5790 31.0833 5.5901 4.9009 5.4846 7.1286 13.5013 15.2327 15.8853 9.1866 18.2368 32.3721 16.4311 2.8506 0.4680 4.2540 162.8377 89.6674 266.6302 182.1431
temp: 298.150 k
press: 1.00000 atm
elementType: 26 7 6 6 6 6 6 1 1 1 7 7 6 1 1 6 1 1 6 1 1 6 1 1 6 1 1 1 6 1 1 6 1 1 7 6 1 1 1 6 1 1 8 1 1 8 1 9 1
symmnumber: 1
zpe: 1124747.4 jmol-1
zpe.correction: 0.428394 hartree
zpe.thermalcorrener: 0.450652 hartree
zpe.thermalcorrenthalpy: 0.451596 hartree
zpe.thermalcorrgfe: 0.380278 hartree
zpe.sumelectzpe: -1141.744982 hartree
zpe.sumelectthermal: -1141.722724 hartree
zpe.sumelectthermalent: -1141.721779 hartree
zpe.sumelectthermalfe: -1141.793098 hartree
dipole: -6.0514 1.7574 -4.9700
dipole: 8.0255
quadrupole: -57.2614 -88.7528 -86.8180
quadrupole: 5.5603 9.2047 4.0451
quadrupole: 20.3493 -11.1421 -9.2073 5.5603 9.2047 4.0451
hfenergy: -1142.1733759 hartree
pointgroup: C01 [X(C14H27F1Fe1N4O2)]
dipole: -2.4664701 0.8122901 -1.7962141 debye
polarizability: 381.5345522|1.367485|332.4399252|11.0994117|2.8684952|281.4970201 unknown
InChI: InChI=1S/C14H23FN4.Fe.2H2O/c1-17-6-7-18(2)9-11-19(10-8-17)12-13-4-3-5-14(15)16-13;;;/h3-5H,6-12H2,1-2H3;;2*1H2
charge 3 multiplicity 6
49 atoms
Fe -0.41361053 -0.51165674 -0.55759205
N  1.72622288 0.04990165 -0.28538746
C  2.01772018 1.35731281 -0.08265469
C  2.72700424 -0.82132316 -0.32793042
C  3.32856602 1.78198293 0.1035686
C  4.0654074 -0.50809734 -0.16216886
C  4.35918591 0.83649945 0.06325683
H  3.53584825 2.83173785 0.2728798
H  4.82249898 -1.28057087 -0.2083282
H  5.38917025 1.14426204 0.20595728
N  -0.39731866 1.62585083 0.34555378
N  -0.68080417 -0.97104899 1.57293396
C  -2.15590882 -1.10642507 1.79279739
H  -2.36887455 -1.05691482 2.86699682
H  -2.42796112 -2.101757 1.43485691
C  0.83907691 2.28446302 -0.16266235
H  0.6810383 2.54989284 -1.21201289
H  1.0299787 3.20860111 0.39248548
C  -0.00756284 0.1114914 2.34274827
H  1.06472133 -0.06925165 2.25535415
H  -0.27924829 0.02543135 3.40199448
C  -0.3600794 1.51023777 1.85087218
H  -1.32567047 1.82091822 2.2439781
H  0.38345769 2.2112093 2.24193823
C  -0.02987861 -2.27184074 1.89548488
H  1.04498019 -2.18983766 1.73700859
H  -0.22089538 -2.5229688 2.94585892
H  -0.44284004 -3.05276007 1.25649667
C  -1.62229608 2.35857402 -0.13726154
H  -1.31824061 3.16636083 -0.80487568
H  -2.11259812 2.81818503 0.72247377
C  -2.97118515 -0.05892634 1.04749808
H  -4.02740809 -0.34637362 1.07016034
H  -2.89866301 0.92273499 1.5102676
N  -2.52550929 0.04498107 -0.37508812
C  -3.28333066 -0.88183908 -1.25439645
H  -3.22704999 -1.89283328 -0.8490694
H  -4.33183262 -0.56458909 -1.29917771
H  -2.85402076 -0.85851063 -2.25836278
C  -2.57895509 1.43485369 -0.9000503
H  -2.30680548 1.3832159 -1.95555425
H  -3.60471825 1.81703722 -0.82903004
O  -0.02409741 0.18898026 -2.73537519
H  -0.75433933 -0.22226342 -3.23013716
H  -0.17963655 1.14545904 -2.81015211
O  -0.4452853 -2.50496795 -1.49523646
H  0.47646199 -2.73580888 -1.70506767
F  2.36364752 -2.10126663 -0.56295687
H  -0.89710706 -2.43353081 -2.35429448
