program: Gaussian 09
title: 1Fe OH
version: ES64L-G09RevE.01
frameworkgroup: C1[X(C14H27FFeN4O2)]
method: UTPSSh
basis: Gen
operation: Freq
keyword: #P
keyword: Geom=AllCheck
keyword: Guess=TCheck
keyword: SCRF=Check
keyword: GenChk
keyword: UTPSSh/ChkBas
keyword: Freq
converged: YES YES YES YES
polarizability: 3.28976317e+02 -2.09552512e+00 3.07245356e+02 1.31097763e+01 3.33899268e+00 2.49820355e+02
1716.lowfreq: 0.0006 0.0010 0.0013 10.7856 23.4395 38.0440 44.8394 63.8964 81.3048
frequency: 44.7690 63.5322 81.1382 97.0455 109.7195 126.1278 135.9642 137.1172 151.5219 163.8959 172.2710 176.3583 188.3505 192.7854 202.1467 205.1231 219.2510 225.1605 232.8573 249.3199 253.8430 272.3945 279.1106 293.8182 314.8259 321.7095 343.0363 382.7752 393.3528 410.4141 426.1933 428.4880 433.1663 443.5050 444.2768 453.1165 465.9958 491.5997 505.6404 521.5551 541.1801 558.3990 586.3778 610.0792 615.5277 651.1856 731.2883 743.7222 753.6882 778.0638 798.8976 813.0380 855.1907 890.3386 908.8490 917.8996 969.7007 987.1933 997.7036 1011.8909 1015.9574 1017.2971 1023.3974 1026.2589 1032.1002 1052.9896 1074.5797 1081.2501 1095.9917 1105.3732 1119.6008 1150.9884 1159.8485 1165.7879 1173.5178 1188.2501 1224.2489 1236.4543 1245.5133 1266.0098 1275.5163 1281.0148 1295.5274 1310.4940 1323.3187 1329.9351 1337.8673 1341.3628 1375.2256 1386.5379 1397.4605 1402.1388 1416.6165 1425.2743 1429.0603 1463.1713 1468.9140 1472.5550 1481.1277 1492.7539 1496.2243 1501.1509 1501.4803 1504.4493 1510.1757 1513.3267 1516.2910 1521.3718 1523.9088 1550.5329 1608.8535 1611.7242 1625.9791 1657.6159 3015.4024 3019.4805 3023.5225 3030.7012 3036.7017 3052.7797 3056.5583 3062.2203 3077.2734 3098.4978 3100.9495 3111.7092 3114.3077 3114.8615 3117.7105 3131.2794 3150.2373 3156.8723 3160.4759 3170.3381 3224.5258 3236.9569 3252.1579 3733.3690 3744.1689 3827.0284 3836.2822
redmass: 4.4482 5.3868 6.6147 4.4456 4.7289 3.3555 2.9205 3.1340 4.8334 2.6662 2.8662 3.4268 4.1017 3.1942 3.1818 4.2012 3.8290 2.2675 1.7573 4.9011 2.3648 1.1425 1.1969 2.5179 2.8531 6.9439 4.4882 2.4730 2.4461 2.4290 1.9028 1.6057 1.4958 2.3674 1.5268 2.6594 3.8017 1.1240 2.4530 1.1041 3.0960 6.8345 3.6094 3.9336 3.4351 3.8863 3.8068 2.1132 4.5560 2.0120 2.2509 1.8818 1.5962 2.0232 1.6189 2.0766 2.4870 2.4688 2.7596 2.3783 1.3460 2.9007 4.1426 2.5394 2.9918 2.7247 2.0875 2.1460 2.4526 1.6828 2.7615 1.5423 1.4980 1.4505 1.1618 1.9277 1.9632 1.8753 2.1526 1.6865 1.5623 1.6990 1.3739 1.2929 1.5167 1.9825 1.3510 1.6548 1.2830 1.4671 1.2869 1.2789 1.2929 1.3547 1.4003 2.6776 1.1735 1.1580 1.3262 1.8549 1.1235 1.0493 1.0457 1.1067 1.0968 1.0502 1.0819 1.0509 1.0777 1.0820 1.1965 3.9179 1.0802 7.3130 1.0652 1.0494 1.0453 1.0674 1.0657 1.0588 1.0709 1.0733 1.0606 1.0956 1.1055 1.0992 1.0920 1.0890 1.0886 1.1050 1.0949 1.1050 1.1053 1.0912 1.0893 1.0953 1.0969 1.0455 1.0456 1.0815 1.0815
irintensity: 0.0961 10.8291 1.7766 3.9927 7.1343 0.7634 3.5708 21.3082 18.9995 25.1317 6.9870 12.5827 9.4724 8.1735 3.5768 23.7174 59.9948 88.0622 43.2962 4.9451 14.1938 8.7202 23.7483 20.3699 18.8319 75.8519 1.8487 1.3514 20.0769 25.0363 9.2153 205.8601 270.7583 40.1164 131.1364 34.5335 11.9177 29.3023 4.6761 231.6766 13.5879 34.2056 6.6230 3.5634 3.6807 4.4630 8.3859 27.5115 24.7278 30.4791 23.4499 131.1030 2.1446 5.3641 25.0615 39.1741 5.3056 22.4859 7.6114 26.6758 2.6427 3.5084 82.2351 63.5000 63.6082 2.2724 49.7181 44.8756 96.0336 13.5359 46.7748 10.6951 3.4337 2.3591 3.2521 0.5805 14.7353 59.4310 4.6949 125.3424 7.1069 38.2744 15.8985 18.1087 13.8339 2.8397 26.9854 39.7420 1.3630 32.1448 22.9382 15.7492 1.9673 19.2234 12.0899 74.6038 1.6924 5.1947 98.8545 90.3862 9.7691 25.6079 10.8565 2.3057 15.4422 12.0892 4.0721 17.3612 3.9274 32.0699 108.1957 141.2937 168.4801 157.2027 52.0425 122.2156 92.0179 68.8713 50.7981 55.3224 65.4900 69.1887 67.2934 24.5847 20.1072 12.3321 42.2420 20.0359 44.7276 39.4171 39.7030 40.7685 40.2072 45.3872 3.2705 3.2644 0.4870 77.2743 66.0502 215.2056 197.3558
temp: 298.150 k
press: 1.00000 atm
elementType: 26 7 6 6 6 6 6 1 1 1 7 7 6 1 1 6 1 1 6 1 1 6 1 1 6 1 1 1 6 1 1 6 1 1 7 6 1 1 1 6 1 1 8 1 1 8 1 9 1
symmnumber: 1
zpe: 1107946.7 jmol-1
zpe.correction: 0.421995 hartree
zpe.thermalcorrener: 0.446569 hartree
zpe.thermalcorrenthalpy: 0.447513 hartree
zpe.thermalcorrgfe: 0.370007 hartree
zpe.sumelectzpe: -1141.934952 hartree
zpe.sumelectthermal: -1141.910378 hartree
zpe.sumelectthermalent: -1141.909434 hartree
zpe.sumelectthermalfe: -1141.986940 hartree
dipole: -1.7495 3.3716 -3.0811
dipole: 4.8910
quadrupole: -79.9780 -103.9242 -104.3096
quadrupole: 1.4711 6.3974 -2.5572
quadrupole: 16.0926 -7.8536 -8.2390 1.4711 6.3974 -2.5572
hfenergy: -1142.3569468 hartree
pointgroup: C01 [X(C14H27F1Fe1N4O2)]
dipole: 0.6296687 -1.8142391 -0.1221403 debye
polarizability: 328.4765988|-11.0167513|282.6253155|-9.379544|-28.5083142|274.940113 unknown
InChI: InChI=1S/C14H23FN4.Fe.2H2O/c1-17-6-7-18(2)9-11-19(10-8-17)12-13-4-3-5-14(15)16-13;;;/h3-5H,6-12H2,1-2H3;;2*1H2
charge 2 multiplicity 5
49 atoms
Fe 0.00106215 0.18649983 -0.9045011
N  -2.27438754 -0.00379742 -0.54266047
C  -2.58415661 -0.88348348 0.44348995
C  -3.24711193 0.77030572 -0.99164631
C  -3.86815219 -0.96143585 0.97754909
C  -4.56216632 0.77533898 -0.5495185
C  -4.86714277 -0.12279571 0.47209177
H  -4.079383 -1.669053 1.77115109
H  -5.29158145 1.44798451 -0.98293222
H  -5.87511243 -0.16672881 0.8704197
N  -0.15213941 -1.15482245 0.8707462
N  0.13262681 1.73576239 0.69728044
C  1.56015884 2.1479856 0.65521643
H  1.79107419 2.83646786 1.48220996
H  1.68772838 2.69727723 -0.28276941
C  -1.4750204 -1.82032816 0.85466244
H  -1.43161601 -2.62385626 0.11019478
H  -1.70341418 -2.27781916 1.82427736
C  -0.30939786 1.11011915 1.97292373
H  -1.3986766 1.19807651 1.99531084
H  0.08392674 1.66692249 2.83557465
C  0.07343567 -0.36899296 2.12031286
H  1.11906831 -0.47837855 2.40263551
H  -0.51604721 -0.79630581 2.94024268
C  -0.69400588 2.9385952 0.44139235
H  -1.75095403 2.66662605 0.44008719
H  -0.52938424 3.70209206 1.21548235
H  -0.42835756 3.36245869 -0.52972137
C  0.93065625 -2.14800902 0.62988919
H  0.63649855 -2.71112008 -0.25942861
H  1.01347108 -2.85412463 1.46746678
C  2.5346114 0.97624945 0.70238265
H  3.53688721 1.34892186 0.45755351
H  2.59137076 0.57582791 1.71430777
N  2.15721299 -0.12255753 -0.2437447
C  2.96325337 -0.01807892 -1.48394034
H  2.82604243 0.97518864 -1.91782222
H  4.03178596 -0.17049984 -1.2773792
H  2.62919863 -0.76795007 -2.20433841
C  2.29449733 -1.47041064 0.3877542
H  2.87907835 -2.12018873 -0.268913
H  2.85532657 -1.37829268 1.32241347
O  -0.14655059 -1.45322068 -2.47465931
H  0.68964875 -1.94170788 -2.54934621
H  -0.78476837 -2.10635681 -2.14250096
O  0.11190047 1.56848977 -2.661337
H  -0.66637155 2.1461496 -2.58568908
F  -2.88867458 1.62714091 -1.98531623
H  -0.05937227 1.01912612 -3.44511973
