program: Gaussian 09
title: Generic comment. This file copied from base file to build structs from
version: ES64L-G09RevE.01
frameworkgroup: C1[X(C18H20FeN4O2)]
method: UTPSSh
basis: Gen
operation: Freq
keyword: #P
keyword: Geom=AllCheck
keyword: Guess=TCheck
keyword: SCRF=Check
keyword: GenChk
keyword: UTPSSh/ChkBas
keyword: Freq
converged: YES YES YES YES
polarizability: 4.02434411e+02 -1.13324360e+00 3.26101363e+02 7.98182273e-01 -4.75680187e+01 4.02538718e+02
1716.lowfreq: -25.0461 -21.1115 -7.7354 -0.0004 0.0004 0.0009 18.8205 45.8000 56.0783
frequency: 18.2466 45.6568 54.8246 80.2343 106.2389 109.5502 118.0869 148.8811 173.7786 193.1543 207.0911 229.1139 236.4063 247.2286 253.1805 258.8896 290.8413 294.0690 315.1369 321.8967 357.9384 370.3378 372.9496 388.0926 426.1958 440.5773 445.5473 464.9640 471.0400 484.7298 492.8314 512.7082 518.3877 614.3001 625.2430 640.3427 645.0430 657.9767 659.8794 664.2335 717.4938 733.0153 735.4080 744.2141 779.6253 781.3030 783.1154 827.7322 841.1566 856.7834 890.2490 900.4556 905.8360 907.6372 923.6835 959.8914 971.9968 989.9532 994.3855 995.4484 1007.6548 1028.3388 1030.9664 1031.6489 1044.4557 1046.0280 1051.2428 1072.8498 1073.9451 1078.7062 1102.9953 1109.4016 1133.1830 1134.4382 1137.3861 1176.9716 1177.4789 1177.7602 1234.2413 1249.9471 1251.2976 1257.9624 1291.3412 1300.4950 1303.6657 1312.4947 1318.7735 1331.0726 1332.5125 1336.0299 1383.5054 1402.4919 1422.2517 1473.1069 1477.5333 1479.2709 1479.6575 1483.4887 1501.6860 1509.5907 1515.5663 1520.5157 1614.0993 1616.3326 1618.3655 1641.1604 1652.1032 1653.9962 1654.6414 3079.8285 3087.3416 3089.0678 3137.0555 3139.5616 3142.8937 3224.8257 3224.8321 3225.5424 3235.6347 3236.7063 3236.8042 3240.2018 3240.6253 3242.8463 3251.3370 3252.1312 3257.3524 3703.1671 3784.3880
redmass: 4.7078 5.1818 3.6328 4.3934 4.2086 3.9470 5.1821 4.0395 4.7064 8.1521 3.3216 5.0533 4.2994 6.1663 5.1588 5.8413 6.2218 5.7435 4.5578 1.1952 3.7585 2.6709 5.0920 8.5942 3.2557 3.2815 3.1811 3.1844 5.0959 3.8112 3.2173 3.4599 4.1193 1.2399 5.6700 5.2694 4.3191 6.2945 6.5663 6.6767 3.2227 3.0821 3.4650 1.2498 1.2633 1.2996 1.2814 4.5213 4.3640 4.1623 4.9865 1.3041 2.0049 1.2969 2.7044 2.1006 1.8180 1.4350 1.4619 1.4019 2.5423 1.3277 1.3288 1.3280 7.6312 7.5171 7.2170 2.2038 2.1571 2.2100 3.3232 2.6496 1.5805 1.5604 1.5437 1.0790 1.0829 1.0829 1.1650 2.0313 1.9194 2.3629 1.5358 1.4668 1.5092 3.0292 3.4242 3.0285 2.0116 1.7727 1.5561 1.4327 1.4633 1.9581 1.5518 1.5285 1.3910 1.3992 1.3174 2.4797 2.2951 2.0606 5.9746 6.1365 6.4844 1.0933 5.6657 5.8991 5.5727 1.0605 1.0600 1.0594 1.1075 1.1071 1.1069 1.0888 1.0891 1.0890 1.0933 1.0927 1.0926 1.0945 1.0935 1.0958 1.0989 1.0988 1.0964 1.0455 1.0821
irintensity: 0.2739 1.6858 0.3153 1.0304 1.8299 2.2599 0.5830 8.7220 11.9585 1.0792 1.6953 3.0129 2.2975 9.3121 2.1866 9.7566 0.5752 11.5081 16.0890 134.2589 1.1233 13.0015 8.5920 77.1067 1.9070 35.7558 16.3518 2.1579 59.7502 0.4623 17.9758 3.4370 12.5651 260.1915 3.4275 5.9028 4.2113 6.4490 0.0924 1.0203 4.7107 8.5867 28.0386 59.0546 34.9815 39.2187 116.8189 20.7091 13.4530 8.9361 214.0682 4.6491 32.4849 1.2025 8.7070 38.6726 12.4476 2.8289 8.1078 3.6155 33.3244 0.0290 0.2230 0.2334 4.7202 22.8528 2.2631 16.5117 2.5545 11.1918 10.0412 18.6020 12.7340 2.1233 5.6931 3.4321 0.9853 8.8545 0.7105 3.2667 23.2659 10.2970 26.6651 43.5771 12.7856 0.7258 5.6262 41.0966 35.8519 16.8147 20.0406 0.9966 3.8402 37.1075 3.1160 30.3372 12.7285 19.5162 144.1580 5.5279 5.2535 65.4578 0.2233 11.7810 27.8125 175.6514 24.9077 95.3644 18.7992 7.5481 7.9987 16.0929 0.8191 0.3388 11.1093 3.5206 3.7775 3.6835 2.6410 3.2972 2.2961 0.6798 0.4062 0.2980 6.4492 3.8367 8.4529 189.5386 253.3681
temp: 298.150 k
press: 1.00000 atm
elementType: 26 7 6 6 6 6 1 6 1 1 1 7 6 1 1 8 8 1 1 6 6 6 6 6 7 1 1 1 1 6 1 1 6 6 6 6 6 7 1 1 1 1 6 1 1
symmnumber: 1
zpe: 959775.9 jmol-1
zpe.correction: 0.365559 hartree
zpe.thermalcorrener: 0.386916 hartree
zpe.thermalcorrenthalpy: 0.387860 hartree
zpe.thermalcorrgfe: 0.315169 hartree
zpe.sumelectzpe: -1190.334343 hartree
zpe.sumelectthermal: -1190.312986 hartree
zpe.sumelectthermalent: -1190.312042 hartree
zpe.sumelectthermalfe: -1190.384734 hartree
dipole: 0.2824 -3.3600 5.7218
dipole: 6.6414
quadrupole: -66.1414 -94.0345 -113.5694
quadrupole: -1.1253 0.2502 -0.9344
quadrupole: 25.1070 -2.7861 -22.3210 -1.1253 0.2502 -0.9344
hfenergy: -1190.6999025 hartree
pointgroup: C01 [X(C18H20Fe1N4O2)]
dipole: 0.2159998 -2.0739572 1.5746336 debye
polarizability: 402.4155525|-4.3947684|370.313722|-1.576565|-60.5674234|358.3452181 unknown
InChI: InChI=1S/C18H18N4.Fe.H2O.O/c1-4-10-19-16(7-1)13-22(14-17-8-2-5-11-20-17)15-18-9-3-6-12-21-18;;;/h1-12H,13-15H2;;1H2;/q-3;+3;;
charge 2 multiplicity 3
45 atoms
Fe -0.09346835 0.25997061 -0.70413933
N  -2.02611495 0.04528277 -0.39929862
C  -2.36336139 -0.92504945 0.486899
C  -2.97443234 0.82578594 -0.95473396
C  -3.69386238 -1.13677514 0.84003477
C  -4.31944629 0.65286364 -0.64980889
H  -2.6235014 1.58439934 -1.64386142
C  -4.68362732 -0.34124862 0.26148501
H  -3.93793712 -1.91190446 1.55751673
H  -5.05901063 1.2932849 -1.11561466
H  -5.72524017 -0.49077511 0.52473457
N  0.02078157 -0.91446278 0.99316038
C  -1.2158365 -1.75582999 0.99705818
H  -1.05348666 -2.59702205 0.31794382
H  -1.41827721 -2.15300749 1.99508351
O  -0.17570557 1.21498537 -2.02405719
O  -0.13188955 -1.46203403 -1.77329498
H  -0.87026894 -1.40950688 -2.40704656
H  0.66779126 -1.53888322 -2.32514141
C  2.33159738 -0.83878634 0.23613144
C  3.69787782 -1.0045367 0.44790784
C  4.59240619 -0.15813137 -0.20872286
C  4.09937855 0.83930692 -1.05324205
C  2.72464446 0.96416949 -1.21692017
N  1.8681798 0.135137 -0.58747056
H  5.66043763 -0.27143087 -0.05691904
H  4.04294879 -1.78385977 1.11776844
H  4.76277722 1.51795761 -1.57610021
H  2.27760874 1.72098682 -1.85015555
C  1.27091213 -1.72112989 0.83953349
H  1.05719994 -2.54577743 0.15356915
H  1.59038029 -2.14115542 1.79693774
C  -0.00742047 1.42325181 1.85499971
C  -0.0107034 2.42257083 2.8294804
C  -0.08477611 3.75612811 2.43744729
C  -0.15481172 4.06267837 1.07508992
C  -0.15092323 3.02814088 0.15114649
N  -0.07822836 1.73666151 0.5441946
H  -0.08791212 4.54544451 3.18128894
H  0.04613489 2.14205136 3.87521549
H  -0.21315308 5.08659815 0.72536534
H  -0.20513042 3.19631315 -0.91657729
C  0.08920739 -0.03335481 2.20926979
H  1.03208397 -0.21689259 2.73166498
H  -0.71850014 -0.30092614 2.89561393
