program: Gaussian 09
title: 000032639
version: EM64L-G09RevD.01
frameworkgroup: C1[X(C7H6Cl6N4O)]
method: RPBEPBE
basis: SDD
operation: Freq
keyword: #p
keyword: freq=noraman
keyword: PBEPBE/SDD
title: #p freq=noraman PBEPBE/SDD
converged: YES YES NO NO
title: Mulliken charges:
elementType: Cl Cl Cl Cl Cl Cl O N N N N C C C C C C C H H H H H H
charge: 0.106454 0.134517 0.127137 0.116277 0.124368 0.122023 -0.447088 -0.302067 -0.047957 -0.015307 0.071983 -0.364483 0.029704 0.299773 0.280087 -0.344713 -0.777635 -0.775405 0.265965 0.231224 0.362225 0.241281 0.211985 0.349651
chargesum: 0.00000
title: Mulliken charges with hydrogens summed into heavy atoms:
elementType: Cl Cl Cl Cl Cl Cl O N N N N C C C C C C C
charge: 0.106454 0.134517 0.127137 0.116277 0.124368 0.122023 -0.097437 0.060158 -0.047957 -0.015307 0.071983 0.132706 0.029704 0.299773 0.280087 0.108553 -0.777635 -0.775405
polarizability: 2.03255661e+02 1.81488682e+01 1.82916659e+02 -3.26824346e+00 -2.26528507e+00 1.30264990e+02
1716.lowfreq: -7.1081 -6.4975 -4.5689 0.0007 0.0016 0.0021 2.8033 8.5729 26.5199
frequency: -4.8419 8.0325 26.5052 55.5694 60.5710 77.5965 82.0554 115.9697 126.2878 154.5754 173.7120 179.3640 204.0525 213.9978 224.0807 245.2202 251.9894 277.8827 289.2879 309.5691 323.0634 336.8446 360.0512 378.8202 407.7744 467.4742 526.3122 605.5634 626.9315 646.4170 660.6072 731.1977 738.2668 760.3574 769.0832 772.6988 783.7791 835.2559 845.0603 892.4163 898.3595 992.9376 1004.2786 1038.2989 1041.4126 1128.3053 1160.8591 1180.8296 1238.0549 1293.3023 1318.6251 1325.9823 1343.9588 1375.4058 1385.3252 1451.5203 1462.8312 1473.4815 1494.8567 1593.4390 2967.7631 3002.0827 3078.0646 3101.3761 3506.5398 3570.2636
redmass: 25.7906 21.4767 4.9992 8.1639 8.7478 14.2923 5.0058 9.0676 6.5048 20.2494 6.9041 21.3360 10.5403 14.3245 19.9012 12.1909 24.5557 13.8800 4.8555 12.0249 4.2564 1.1997 10.1523 25.8014 13.5921 4.4790 4.3006 13.3727 6.0280 11.3097 12.6579 1.9777 6.5337 2.9764 6.7233 8.3100 5.6049 11.9104 2.6995 3.3981 7.6666 6.6892 2.2358 3.6265 2.1611 3.3206 2.5203 1.7315 1.4554 6.2781 1.9996 1.7030 1.9680 1.1972 2.4006 3.5397 1.0838 1.1146 5.5276 7.5338 1.0693 1.0655 1.0926 1.1013 1.0769 1.0665
irintensity: 0.0149 0.0513 0.6412 2.2331 2.2488 0.7329 3.5409 2.9857 4.9694 0.7677 0.1958 0.2999 7.8411 1.6156 0.9137 0.5449 0.5364 0.4017 1.0744 21.4812 39.4075 150.8257 1.0077 0.8953 0.2190 22.8806 8.1981 0.9047 18.6613 179.2646 116.3815 4.9484 167.5531 223.8569 32.1012 52.8931 19.5566 1.4600 40.4486 15.2819 12.5226 56.7311 65.5958 65.3036 6.8785 9.2201 34.1811 2.4183 62.2004 45.4598 13.4204 6.8681 16.6195 11.2541 123.2013 191.0338 13.5251 61.2193 164.1406 782.7197 38.2951 61.7512 6.1034 22.8151 167.5906 10.0025
temp: 298.150 k
press: 1.00000 atm
elementType: 17 17 17 17 17 17 8 7 7 7 7 6 6 6 6 6 6 6 1 1 1 1 1 1
symmnumber: 1
zpe: 358714.9 jmol-1
zpe.correction: 0.136627 hartree
zpe.thermalcorrener: 0.155423 hartree
zpe.thermalcorrenthalpy: 0.156367 hartree
zpe.thermalcorrgfe: 0.085460 hartree
zpe.sumelectzpe: -3323.540635 hartree
zpe.sumelectthermal: -3323.521839 hartree
zpe.sumelectthermalent: -3323.520895 hartree
zpe.sumelectthermalfe: -3323.591802 hartree
dipole: -6.3770 -2.5843 1.0992
dipole: 6.9680
quadrupole: -126.9377 -154.0981 -141.6031
quadrupole: 11.9018 -5.7087 -5.5314
quadrupole: 13.9419 -13.2185 -0.7235 11.9018 -5.7087 -5.5314
hfenergy: -3323.6772624 hartree
pointgroup: C01 [X(C7H6Cl6N4O1)]
dipole: 2.7023794 -0.1703817 0.4283851 debye
dipolederiv: -0.3278392 0.0520817 0.2645081 0.046919 -0.2037349 0.046573 0.24232 0.0526341 -0.6308934 -0.1945194 -0.1936905 0.0203005 -0.198141 -0.6307115 0.050977 0.0236315 0.0338956 -0.1266079 -0.3994725 -0.004303 -0.3094062 -0.0073402 -0.168404 -0.0634125 -0.2611611 -0.0838643 -0.4759383 -0.2571414 -0.068904 -0.2627828 -0.0632513 -0.232198 -0.0703878 -0.2375897 -0.0427621 -0.6113903 -0.4670365 0.2890854 -0.0145084 0.2940283 -0.3697957 0.013604 -0.0120871 0.0094858 -0.1311895 -0.3480041 -0.1120323 0.2962295 -0.1058522 -0.2343902 0.0960315 0.2706165 0.0645882 -0.4909925 -0.7961767 -0.1941405 0.1097673 -0.3511512 -0.6081353 -0.1900938 0.1404098 -0.212466 -0.3146636 -1.7011221 -0.1573953 -0.0496029 -0.4039207 -0.2932796 0.0178445 0.085554 0.0275767 -0.4097944 -1.147258 -0.0757992 -0.0425106 -0.7841666 -0.7059824 -0.0667607 -0.0791938 -0.0313501 -0.1935484 -1.4230376 -0.1326711 -0.0412525 0.4160464 -0.4961013 0.0008937 -0.060692 -0.032768 -0.2001724 -0.6399889 0.2500848 -0.0074075 0.2076947 -1.4936074 -0.1003717 -0.0096536 -0.060628 -0.0800119 0.4083802 -0.1645859 0.0738445 -0.4662171 0.072189 -0.0811615 0.038063 -0.0335475 0.2417612 2.2747648 0.3149081 0.0970546 0.578073 0.4391698 0.0292824 0.1405096 0.0228018 0.2928132 0.85432 -0.0250842 0.0340164 0.1744177 1.083699 0.0934647 0.0683166 0.0822208 -0.025968 0.9543443 -0.119018 0.0141105 -0.1863828 0.9669822 0.0780884 -0.0468045 0.1174694 -0.0279092 0.5395347 0.165286 0.0249598 0.280585 0.527647 0.1573255 -0.0362678 0.1568325 0.3272156 0.871653 0.2969871 0.0424531 0.2147368 1.0617584 -0.0450291 0.0656077 -0.0595688 1.270469 1.1161461 -0.2642903 -0.0295038 -0.1924573 0.7827845 -0.0526613 -0.0338568 -0.0625094 1.2667471 0.0886084 -0.0615009 -0.0352421 0.0337278 0.0076278 -0.0513309 0.0040715 -0.0533356 0.0638228 -0.0975643 0.019552 -0.0372068 0.1359991 0.0741665 0.0363336 -0.0884306 0.070471 -0.1248698 0.342868 0.053606 -0.0071371 0.2155627 0.228823 -0.0013524 -0.0235056 -0.0117233 0.299566 0.1092976 -0.013795 -0.0559774 -0.0439421 0.0326852 0.043038 -0.0229212 -0.0027882 -0.097766 -0.1681339 0.0871807 0.0036151 0.0878073 -0.0871401 -0.0411431 -0.0360588 -0.0007812 0.0821354 0.4073774 0.0584385 -0.0883213 0.1172248 0.245948 0.1002482 -0.1308776 0.0501169 0.0971855 unknown
polarizability: 213.520909|3.5439336|172.3826016|4.3299402|3.3238426|130.5338004 unknown
InChI: InChI=1S/C7H6Cl6N4O/c8-6(9,10)3-15-4(7(11,12)13)17-5(16-3)14-1-2-18/h14,18H,1-2H2
charge 0 multiplicity 1
24 atoms
Cl -3.077532 1.914097 1.688627
Cl -1.508138 3.792579 -0.08303
Cl -3.408944 1.817782 -1.326104
Cl -1.928196 -2.875233 -1.84681
Cl 0.370774 -3.879755 -0.172574
Cl -2.198526 -3.056642 1.170331
O  5.042094 1.691912 0.098211
N  2.418714 0.692341 0.149727
N  0.766488 -0.978795 -0.028217
N  0.186958 1.395506 0.079757
N  -1.549719 -0.28205 -0.0928
C  3.528386 -0.269947 0.173341
C  1.108515 0.358499 0.065804
C  -0.559392 -1.218451 -0.105073
C  -1.100102 1.006421 -0.000782
C  4.755876 0.371641 -0.495011
C  -2.191225 2.085036 0.049583
C  -1.029239 -2.675694 -0.22581
H  3.216584 -1.188415 -0.351737
H  3.763659 -0.55169 1.221089
H  2.659423 1.686372 0.232948
H  4.55081 0.585634 -1.556002
H  5.627229 -0.308517 -0.424589
H  5.491405 1.576874 0.973322
