program: Gaussian 09
title: 000032606
version: EM64L-G09RevD.01
frameworkgroup: C1[X(C6H13Cl2O2P)]
method: RPBEPBE
basis: SDD
operation: Freq
keyword: #p
keyword: freq=noraman
keyword: PBEPBE/SDD
title: #p freq=noraman PBEPBE/SDD
converged: NO YES NO NO
title: Mulliken charges:
elementType: Cl Cl P O O C C C C C C H H H H H H H H H H H H H
charge: -0.024266 -0.004352 1.237689 -0.555607 -0.616359 0.030838 -0.333615 -0.684349 -0.796948 -0.777202 -0.687086 0.239121 0.205153 0.193572 0.219373 0.237496 0.206904 0.321257 0.313934 0.296823 0.318033 0.204935 0.238237 0.216420
chargesum: 0.00000
title: Mulliken charges with hydrogens summed into heavy atoms:
elementType: Cl Cl P O O C C C C C C
charge: -0.024266 -0.004352 1.237689 -0.555607 -0.616359 0.269959 0.065110 -0.020577 -0.161757 -0.162346 -0.027495
polarizability: 1.37652015e+02 5.95979106e+00 1.15629318e+02 8.73480764e-01 -2.39883438e-01 8.83322210e+01
1716.lowfreq: -13.8030 -9.8964 -5.1490 -0.0021 -0.0019 -0.0008 18.9391 42.2744 51.5361
frequency: 16.2925 42.0288 51.3833 58.2785 78.6214 87.7673 119.1339 147.9348 191.1152 198.6589 200.6676 204.7581 220.9435 253.0610 335.4597 352.8726 375.0244 422.1220 472.2699 586.8028 620.9380 650.1060 698.1344 732.4620 779.3633 802.6032 823.9065 830.6670 876.0741 961.6514 992.6724 1017.3069 1041.6743 1098.8612 1103.2019 1129.0208 1139.5952 1177.0587 1213.7989 1222.6079 1259.4800 1290.4584 1340.0670 1356.6874 1386.1479 1387.5073 1391.3540 1395.7427 1449.2561 1463.4722 1470.3715 1476.2778 1485.0564 2978.5073 2984.9081 2989.2186 2991.8751 3035.8004 3071.2302 3071.5015 3078.7222 3084.5829 3087.4998 3103.8630 3169.5205 3172.4127
redmass: 3.9122 4.8790 4.6603 4.1149 1.9171 11.2914 3.8740 4.4932 3.8314 1.1678 3.7330 1.3084 3.5806 3.7326 3.2201 6.0436 3.9700 3.6457 3.3868 5.2379 4.8767 5.3104 6.8990 5.3547 1.4107 1.5681 2.3234 1.6298 3.2768 1.2946 1.3326 4.7406 3.3011 1.6336 1.0892 1.9471 1.2556 2.1321 1.1506 1.1484 1.1856 1.2911 1.2909 1.4403 1.2122 1.0861 1.1943 1.0846 1.0750 1.0531 1.0459 1.0489 1.0501 1.0574 1.0375 1.0397 1.0835 1.1003 1.0546 1.0542 1.0989 1.0992 1.1000 1.1003 1.1116 1.1119
irintensity: 0.6256 3.2311 2.7554 1.3712 0.4182 0.6165 5.8421 9.6669 1.1697 1.1656 1.2348 0.9130 0.5985 3.7989 1.9023 46.3232 14.3378 20.0606 3.3223 5.1458 52.8579 38.3651 3.6478 2.9053 11.8995 20.0291 97.0503 9.6010 192.5777 19.9645 39.7543 69.0867 10.7970 23.3495 2.5347 9.3678 22.2181 10.2765 1.2381 2.0007 1.6576 1.9219 11.6443 6.8205 18.7997 8.7497 15.3296 5.7395 3.4863 8.8994 16.2226 7.5723 17.6635 28.6085 22.7721 29.0985 5.6199 12.7524 4.9932 3.1765 49.2321 28.0621 53.4781 20.0809 0.2606 0.2678
temp: 298.150 k
press: 1.00000 atm
elementType: 17 17 15 8 8 6 6 6 6 6 6 1 1 1 1 1 1 1 1 1 1 1 1 1
symmnumber: 1
zpe: 486272.5 jmol-1
zpe.correction: 0.185211 hartree
zpe.thermalcorrener: 0.200617 hartree
zpe.thermalcorrenthalpy: 0.201562 hartree
zpe.thermalcorrgfe: 0.139689 hartree
zpe.sumelectzpe: -1647.299922 hartree
zpe.sumelectthermal: -1647.284516 hartree
zpe.sumelectthermalent: -1647.283572 hartree
zpe.sumelectthermalfe: -1647.345444 hartree
dipole: 0.9679 -0.8165 -3.0461
dipole: 3.2989
quadrupole: -83.8543 -89.0721 -96.5238
quadrupole: -2.8197 2.1404 0.7111
quadrupole: 5.9624 0.7447 -6.7070 -2.8197 2.1404 0.7111
hfenergy: -1647.4851334 hartree
pointgroup: C01 [X(C6H13Cl2O2P1)]
dipole: -0.5749153 -1.0832945 -0.4247711 debye
dipolederiv: -0.4747967 -0.0073401 0.2196801 -0.0058885 -0.1266227 0.0100373 0.1708323 0.0119836 -0.3002938 -0.158772 0.0041746 -0.0098106 0.0051484 -0.1155415 0.0467542 -0.0316949 0.0495851 -0.4499496 1.7889874 0.0278113 0.1303847 0.1398776 1.2471287 -0.1889526 -0.2391784 -0.0284045 1.3733113 -1.5628048 -0.1288047 0.3599869 -0.1053985 -0.5282348 0.0562101 0.517614 0.110539 -0.7154703 -0.7018968 -0.0171775 -0.036725 -0.0094525 -0.6573219 0.0457591 0.0262887 0.0015694 -0.6029678 1.0230742 0.0467579 -0.2386568 -0.2864407 0.184494 0.0602407 -0.4404644 -0.1472116 0.4474174 -0.0398794 0.0177285 -0.0299384 0.0429002 0.0967861 0.0648648 0.0072068 0.0915871 0.0321717 -0.0930136 0.0041454 0.0089513 0.034694 -0.0095244 0.1087051 0.0681814 0.1388056 -0.1021425 0.3949189 0.0331623 -0.3478484 0.091735 -0.0880523 -0.0449656 -0.1736073 -0.0216084 -0.0886132 -0.1798781 0.0512891 -0.1191969 0.056553 -0.0968716 0.0338137 0.0288673 -0.04936 0.3785673 0.0542666 0.0075563 -0.0279478 -0.0195809 -0.0109255 0.06647 -0.0521428 0.061633 -0.0027796 -0.0093998 -0.0484795 -0.0223337 0.0061477 -0.0583597 -0.0722834 0.021488 -0.0119798 0.0092022 0.0648875 -0.0294761 -0.0259478 -0.0834429 -0.1320101 -0.0578353 -0.0614142 -0.0487211 0.0243766 -0.1037669 0.0192915 0.1150642 0.0617339 0.0667674 -0.0202509 0.113183 -0.0160973 -0.0518295 0.0868891 -0.0560381 -0.0178621 -0.0565612 -0.070549 -0.0451149 -0.0536656 -0.1244254 0.0313274 -0.0090784 0.0540258 -0.1292551 0.0329579 0.068124 0.0294678 -0.1069814 0.034263 0.0236002 -0.0661552 0.0299381 0.138549 0.0360166 0.0564412 -0.0308001 0.1412853 -0.0117444 0.0009767 -0.0140831 0.0365645 -0.004128 0.0331181 0.071979 0.017248 -0.0123602 0.0501406 0.002888 0.0024151 -0.0467191 0.0405314 -0.0290282 -0.0031129 -0.0407667 0.0503453 -0.0360547 0.0402871 0.0726916 0.0366822 -0.0206781 0.0354407 -0.0303782 -0.0221445 -0.0074835 -0.0254102 -0.0427006 -0.0092458 -0.0378216 0.0020592 -0.0131741 0.0838883 0.0321214 0.0073526 0.0245204 -0.0027007 -0.0198002 0.0261213 0.1587125 0.0568401 0.0279533 -0.0537378 0.1593948 -0.0291366 -0.0506967 0.0958158 -0.0992517 -0.0176287 -0.0729365 -0.0487168 -0.0452625 -0.0293133 -0.0831757 0.0304799 -0.1413757 0.0758595 -0.1259621 0.0487408 0.0726595 0.050422 -0.1037335 0.0587031 0.0155387 unknown
polarizability: 128.8873474|-0.9033496|90.4948473|-12.8450512|-7.748653|122.2313588 unknown
InChI: InChI=1S/C6H13Cl2O2P/c1-3-6(2)10-11(9,4-7)5-8/h6H,3-5H2,1-2H3
charge 0 multiplicity 1
24 atoms
Cl 2.822378 0.291957 -2.765818
Cl 1.877216 -0.290124 2.32775
P  0.792749 0.592292 -0.420914
O  -0.583602 -0.445608 -0.15085
O  0.601464 2.138952 -0.065335
C  -1.709736 0.018706 0.740852
C  -2.947419 0.295047 -0.133339
C  -1.930894 -1.090857 1.773932
C  1.027498 0.154149 -2.244594
C  2.208625 -0.273559 0.492752
C  -2.740472 1.39925 -1.190232
H  -1.385188 0.95895 1.231588
H  -3.257337 -0.650195 -0.62056
H  -3.769173 0.584715 0.552645
H  -2.208446 -2.034739 1.272245
H  -1.017518 -1.261601 2.367771
H  -2.749645 -0.808015 2.461447
H  0.451517 0.866121 -2.851792
H  0.704648 -0.881805 -2.413878
H  2.286716 -1.317567 0.158934
H  3.146004 0.275926 0.332998
H  -2.030081 1.071282 -1.970507
H  -2.336133 2.321543 -0.735487
H  -3.693571 1.646782 -1.691507
