program: Gaussian 09
title: Ru_N-AlCo3-Evac-b3lyp-ls-pcmbb. From the converged PCo4 structure
version: ES64L-G09RevE.01
frameworkgroup: C1[X(Al2Co3H2O69RuW18)]
method: UB3LYP
basis: Gen
operation: FOpt
keyword: #p
keyword: opt
keyword: ub3lyp
keyword: gen
keyword: pseudo=read
keyword: scrf=(PCM,solvent=h2o)
keyword: guess=read
keyword: scf=(xqc,converg=6)
title: #p opt ub3lyp gen pseudo=read scrf=(PCM,solvent=h2o) guess=read scf=(x
basis: NPDir=0 NMtPBC= 1 NCelOv= 1 NCel= 1 NClECP= 1 NCelD= 1
basis: NCelK= 1 NCelE2= 1 NClLst= 1 CellRange= 0.0.
basis: One-electron integrals computed using PRISM.
basis: 1 Symmetry operations used in ECPInt.
basis: ECPInt: NShTT= 109746 NPrTT= 673790 LenC2= 79499 LenP2D= 263059.
basis: LDataN: DoStor=T MaxTD1= 6 Len= 172
basis: NBasis= 1496 RedAO= T EigKep= 1.39D-04 NBF= 1496
basis: NBsUse= 1496 1.00D-06 EigRej= -1.00D+00 NBFU= 1496
converged: YES YES YES YES
dipole: 4.4835 0.6779 -0.0050
dipole: 4.5345
quadrupole: -2495.1978 -1559.4484 -1596.9406
quadrupole: 16.8989 0.0108 -0.0259
quadrupole: -611.3355 324.4138 286.9217 16.8989 0.0108 -0.0259
hfenergy: -7433.0455924 hartree
pointgroup: C01 [X(Al2Co3H2O69Ru1W18)]
dipole: -1.7639234 0.2668203 0.0022226 debye
InChI: InChI=1S/2Al.3Co.H2O.68O.Ru.18W/h;;;;;1H2;;;;;;;;;;;;;;;;;;;;;;;;;;;;;;;;;;;;;;;;;;;;;;;;;;;;;;;;;;;;;;;;;;;;;;;;;;;;;;;;;;;;;;;
charge -14 multiplicity 10
95 atoms
Co 0.02365279 0.02553332 -1.55835116
Co 0.02397352 0.02124289 1.55834266
Ru -0.80064919 -2.57991907 -0.00344091
Co 0.8317462 2.59071605 0.00378087
H  -0.55135786 4.77276227 -0.77197419
H  -0.55136403 4.77069043 0.78518911
O  -1.40725591 -0.43418343 3.04942072
O  1.42810445 0.45571573 -3.05292256
O  0.68427349 -2.05234315 -1.46725331
O  -0.68289615 2.05480549 1.44635501
O  -5.5505703 2.27079499 0.00313848
O  5.55485313 -2.29380651 -0.00316593
O  -2.40178347 1.99703404 3.56574023
O  2.4099948 -1.97366216 -3.57284441
O  -3.09087686 -0.17643479 5.24493254
O  3.12008294 0.20151484 -5.23811024
O  -3.33668396 0.91814468 1.45224753
O  3.35424845 -0.92686816 -1.44962771
O  -1.26148345 -0.57932732 -0.00069404
O  1.29309295 0.5983066 0.00077602
O  -3.33646527 0.92230047 -1.44973771
O  3.35422153 -0.93105882 1.44697782
O  -4.07043015 -1.48183786 -0.00187817
O  4.07776356 1.48687388 0.00203025
O  -2.60179063 3.21513095 0.00431529
O  2.5518609 -3.27969455 -0.00459098
O  -2.40199053 2.00726189 -3.5604933
O  2.41008354 -1.98351119 3.56731469
O  -3.90798603 -1.5068993 -2.89649024
O  3.9300241 1.50399317 2.86875566
O  -4.28755976 -4.06767337 -0.00566076
O  4.29563895 4.03959274 0.00575332
O  -6.17893528 0.12285861 1.29860812
O  6.19446471 -0.14161613 -1.29380545
O  -6.95580445 2.59633315 2.43901078
O  6.95724245 -2.61099377 -2.44034776
O  -4.90641614 1.0075266 3.48502209
O  4.91659922 -1.01140878 -3.48653481
O  -4.25984648 3.26541174 2.13253512
O  4.25833909 -3.26645378 -2.12661803
O  -1.70035913 4.48284166 -2.300549
O  1.74672256 -4.46618001 2.41380833
O  -0.68269195 2.05917863 -1.44128802
O  0.68423261 -2.05672547 1.46170024
O  -4.2599131 3.27162112 -2.12363502
O  4.25853576 -3.27239268 2.11773416
O  -6.9558309 2.60305895 -2.43171532
O  6.95740537 -2.61750101 2.43304091
O  -6.1787748 0.12643557 -1.29825083
O  6.19447322 -0.14510412 1.29318935
O  -5.96627231 -2.54391295 -1.36903215
O  6.00887987 2.52340758 1.368133
O  -8.13582764 -1.44731449 -0.00228489
O  8.17384974 1.41568255 0.00184113
O  -5.96649116 -2.54791521 1.361556
O  6.0088162 2.52750052 -1.36107182
O  -4.30025625 -4.31323993 2.81553187
O  4.37076418 4.3018103 -2.79531003
O  -2.23010536 -3.08281535 1.4078001
O  2.2341948 3.12232634 -1.46074014
O  1.74633961 -4.45938718 -2.42624093
O  -1.70024894 4.47615732 2.31272617
O  -3.0911037 -0.16204941 -5.24531713
O  3.11992777 0.18691905 5.23875327
O  -4.90638961 1.01712107 -3.48200174
O  4.91674659 -1.02086878 3.48364916
O  -1.40734391 -0.42510933 -3.0505588
O  1.42836487 0.44748523 3.05412793
O  -2.22996658 -3.07808176 -1.41605111
O  2.23434776 3.11772686 1.46966014
O  0.04553357 4.74633987 0.0065697
O  -4.29947477 -4.30587206 -2.82723684
O  4.37089147 4.29376736 2.80738261
O  -3.90782045 -1.51473892 2.89224342
O  3.92973205 1.5121691 -2.86439528
Al -2.97521092 -0.06854828 -0.00006251
Al 2.97826768 0.06318419 0.0001086
W  -3.0570723 0.07761586 3.50571265
W  3.06929405 -0.08806765 -3.50514333
W  -4.01734712 -3.03313723 -1.64969473
W  4.01673533 3.01980437 1.65119231
W  -2.26566864 2.8641575 -1.8663683
W  2.27623378 -2.88067189 1.87492583
W  -5.47557769 1.84367097 -1.88684466
W  5.48677962 -1.84095337 1.88024186
W  -3.05765671 0.08668985 -3.50531379
W  3.06941882 -0.09785995 3.50503106
W  -2.26578384 2.85894615 1.87328643
W  2.27607222 -2.87542871 -1.88294034
W  -6.39245326 -1.28830073 -0.00199428
W  6.42590141 1.29689637 0.0017329
W  -5.47565767 1.8381195 1.89219953
W  5.48673422 -1.83576098 -1.8854195
W  -4.0174377 -3.037103 1.64186173
W  4.01659144 3.02467122 -1.64263957
