program: Gaussian 09
title: Mn_N-SiCo3-Eooh-b3lyp-hs-pcmbb-freqb, From Mn_PEooh structure
version: ES64L-G09RevE.01
frameworkgroup: C1[X(Al2Co3H3MnO71W18)]
method: UB3LYP
basis: Gen
operation: Freq
keyword: #p
keyword: ub3lyp
keyword: gen
keyword: pseudo=read
keyword: scrf=(PCM,solvent=h2o)
keyword: guess=read
keyword: scf=(xqc,
keyword: converg=8)
keyword: freq
title: #p ub3lyp gen pseudo=read scrf=(PCM,solvent=h2o) guess=read scf=(xqc,
basis: NPDir=0 NMtPBC= 1 NCelOv= 1 NCel= 1 NClECP= 1 NCelD= 1
basis: NCelK= 1 NCelE2= 1 NClLst= 1 CellRange= 0.0.
basis: One-electron integrals computed using PRISM.
basis: 1 Symmetry operations used in ECPInt.
basis: ECPInt: NShTT= 114960 NPrTT= 705502 LenC2= 83089 LenP2D= 273008.
basis: LDataN: DoStor=T MaxTD1= 6 Len= 172
basis: NBasis= 1529 RedAO= T EigKep= 1.31D-04 NBF= 1529
basis: NBsUse= 1529 1.00D-06 EigRej= -1.00D+00 NBFU= 1529
converged: YES YES NO YES
polarizability: 2.03385681e+03 3.45908010e+01 1.81976250e+03 -8.21583967e-01 7.06262735e-01 1.83873598e+03
1716.lowfreq: -4.6858 -0.0096 -0.0071 -0.0069 2.2340 4.0467 21.7749 32.4878 37.4310
redmass: 59.8334 38.5780 38.6945 72.6738 68.1491 53.5242 50.4687 23.5707 33.4946 44.4294 63.6034 60.7449 64.9078 51.8307 58.5965 52.8967 52.1942 41.4421 52.1490 48.4025 36.6092 41.3029 43.7795 37.1092 48.0449 38.0918 41.6019 34.6462 31.8528 41.8156 23.8079 24.4377 27.4248 23.5814 26.9134 23.2368 26.9046 34.4135 31.4836 27.0161 24.0290 17.1450 20.9246 23.6843 16.9902 16.2419 21.5623 21.8382 22.9254 32.2330 24.5786 20.9123 22.0267 22.9286 16.8633 23.3099 24.0992 23.7037 23.3391 26.3357 21.6019 25.3025 23.6919 22.3906 25.0926 22.5826 19.5588 19.6235 22.8945 20.7739 18.1814 25.1969 25.1386 22.2320 26.4366 30.1222 22.1087 25.3928 23.8537 21.3004 19.6259 16.1500 18.1509 20.7757 19.7793 18.4541 15.8376 18.8419 18.2529 25.4415 22.1350 19.1260 18.2618 18.7415 18.0100 17.3037 18.3280 19.7477 17.4890 17.8304 18.4904 17.6088 17.7960 20.7201 17.2296 16.6458 20.9198 18.3764 19.3084 20.5547 16.9208 16.6131 17.1508 15.9570 16.8477 18.7757 17.6244 19.1877 16.0030 16.6463 16.8120 16.1253 18.4825 17.6357 15.5295 15.2296 17.8601 17.2737 17.4896 17.9112 17.3614 16.5614 15.8352 16.6107 16.6760 16.8501 16.8338 17.5982 16.9777 17.6416 18.9005 17.9176 17.5149 17.7368 17.1402 17.4077 18.3442 17.7013 18.1647 17.7990 18.1499 17.7038 17.4473 18.2167 17.7292 17.2028 17.8033 17.6111 16.8496 16.5709 17.4801 17.5240 17.6092 17.1010 17.1424 16.9627 17.0522 16.8737 17.7280 16.7760 17.2417 16.9794 15.4482 16.5266 14.9421 18.4027 17.2066 16.6528 16.8465 15.4898 16.3610 14.8466 17.1439 16.9157 16.7186 16.8943 16.9530 16.1363 16.6142 16.1611 16.5698 17.0854 16.7928 16.8173 16.4383 15.8359 16.4601 7.4911 6.3021 15.5494 2.6941 4.1402 2.5204 9.3671 16.7584 16.3910 4.1506 16.6082 16.7310 17.3540 17.0417 16.2567 16.1012 7.8724 14.6601 16.4277 8.3462 13.0020 16.5348 16.4010 15.5225 6.4950 16.4564 16.4209 15.6509 16.1481 16.2627 4.8661 6.8169 16.0695 13.6296 13.9972 16.0489 11.6705 15.3181 12.8446 15.8622 17.6210 17.1921 15.3401 13.6756 17.4489 16.8335 16.5604 15.2799 8.5016 10.0736 1.2626 1.3281 10.5551 16.0646 12.4371 10.1075 15.9930 16.7059 16.9641 15.0094 16.7200 16.3398 17.2930 17.2538 16.4401 17.2652 16.5047 15.6344 16.6261 16.2011 16.7809 16.3774 16.7715 15.3292 16.3717 16.4070 16.4182 16.4885 16.4423 16.3968 17.2142 17.0177 16.8178 16.8369 16.7611 16.6901 1.0874 1.0760 1.0714 1.0473 1.0856
irintensity: 0.0065 0.2271 2.7582 0.4810 0.9275 6.6794 1.7316 4.0851 3.1929 0.5906 14.1719 1.7000 2.4369 0.5612 0.8044 9.4106 11.5757 1.0956 1.7104 43.6469 15.6258 6.0199 11.2646 2.4648 22.1878 8.8693 41.3341 1.2934 3.0688 15.7947 1.0502 1.2765 2.2492 0.4191 2.1529 1.5089 27.4927 6.4689 0.8910 10.5564 31.1482 9.5234 15.6290 20.9610 7.6573 1.9275 0.9573 1.9712 27.9373 1.7144 16.1991 6.2766 3.6159 52.1438 2.8030 1.3641 3.2213 14.3790 10.0487 17.7722 4.0126 8.8787 1.8024 15.6523 112.7478 6.5270 60.1247 1.7255 17.4075 11.3071 55.7830 15.1830 63.3850 34.6340 6.5043 12.6859 52.0259 3.7218 95.5808 31.4831 2.1571 25.7561 10.6488 40.2713 71.6321 4.3233 127.5170 9.7230 196.4603 12.0861 20.1079 40.5707 38.0928 528.6029 137.0580 105.0161 36.3845 116.9609 108.2939 86.4992 231.0146 81.6479 29.8882 39.6673 8.2981 6.7591 151.9995 440.0945 81.5618 24.0205 23.3217 0.1756 3.1957 80.2378 15.5907 104.1764 19.6655 277.9771 34.9613 40.9490 33.9681 309.0778 184.7757 83.1730 9.8919 514.4860 841.0751 23.7723 82.4147 503.8462 168.5387 44.7014 17.4118 17.7173 373.6139 157.9083 67.8045 21.4343 353.1643 96.2594 329.5951 227.2885 440.7898 251.5119 526.1451 154.1374 134.8349 11.7899 67.2668 450.5029 371.2981 120.6493 22.6880 324.9373 580.6590 134.7703 150.2430 56.8043 87.1614 171.5262 385.3418 143.7242 179.6827 66.2085 408.5291 298.6590 142.7495 38.4789 305.8727 19.9052 31.6841 1.9759 173.9026 143.3002 3.4850 24.1616 19.1045 7.5563 3.9952 0.2240 35.3892 10.4125 59.0858 46.8833 19.3035 537.9157 78.1094 77.1127 545.2531 105.7550 308.8718 434.0189 24.1213 137.9467 66.0811 25.4528 166.5882 222.8964 109.0280 289.0770 108.7735 138.8995 127.4920 101.8067 61.1997 288.9300 28.6135 386.9036 430.9174 836.0090 22.3626 78.5360 34.0520 12.3750 31.3476 2780.4858 127.0839 5.1329 62.0646 407.0235 41.1102 5.5151 88.8055 141.9686 121.9546 142.9315 214.4386 442.5706 120.5937 1911.3445 5080.6218 6987.9307 2738.6162 97.2164 2789.3897 1740.3374 3947.2510 24.4891 3250.9886 479.8841 511.4876 2158.0219 206.9176 1602.9852 2668.3690 408.3302 231.7657 104.5016 42.7074 1043.0102 111.6182 407.8653 1011.7023 1948.8278 946.6276 356.6776 123.4747 251.8583 713.8946 166.2630 155.9332 942.1884 1719.5573 141.7453 535.0005 153.6947 555.1862 1022.5468 126.2160 718.5507 204.8816 274.4196 4.3595 17.5730 42.0298 81.4806 13.3565 65.5998 88.0253 0.6917 1.9259 0.7438 18.7495 87.3852 101.6624 572.3055 622.4103 415.3368
temp: 298.150 k
press: 1.00000 atm
elementType: 27 27 25 27 1 1 8 8 8 8 8 8 8 8 8 8 8 8 8 8 8 8 8 8 8 8 8 8 8 8 8 8 8 8 8 8 8 8 8 8 8 8 8 8 8 8 8 8 8 8 8 8 8 8 8 8 8 8 8 8 8 8 8 8 8 8 8 8 8 8 8 8 8 8 8 8 13 13 74 74 74 74 74 74 74 74 74 74 74 74 74 74 74 74 74 74 8 1
symmnumber: 1
zpe: 764641.6 jmol-1
zpe.correction: 0.291237 hartree
zpe.thermalcorrener: 0.402205 hartree
zpe.thermalcorrenthalpy: 0.403149 hartree
zpe.thermalcorrgfe: 0.154556 hartree
zpe.sumelectzpe: -7593.711384 hartree
zpe.sumelectthermal: -7593.600416 hartree
zpe.sumelectthermalent: -7593.599471 hartree
zpe.sumelectthermalfe: -7593.848065 hartree
dipole: 9.8746 -7.4499 0.0676
dipole: 12.3698
quadrupole: -2332.1325 -1549.8786 -1546.8086
quadrupole: -18.9318 0.2344 -0.7118
quadrupole: -522.5259 259.7280 262.7979 -18.9318 0.2344 -0.7118
hfenergy: -7594.0026207 hartree
pointgroup: C01 [X(Al2Co3H3Mn1O71W18)]
dipole: 3.88495 -2.9310224 0.0265885 debye
polarizability: 2033.8568079|34.5908032|1819.7625037|-0.821584|0.7062627|1838.7359829 unknown
InChI: InChI=1S/2Al.3Co.Mn.H2O2.H2O.68O.18W/c;;;;;;1-2;;;;;;;;;;;;;;;;;;;;;;;;;;;;;;;;;;;;;;;;;;;;;;;;;;;;;;;;;;;;;;;;;;;;;;;;;;;;;;;;;;;;;;;/h;;;;;;1-2H;1H2;;;;;;;;;;;;;;;;;;;;;;;;;;;;;;;;;;;;;;;;;;;;;;;;;;;;;;;;;;;;;;;;;;;;;;;;;;;;;;;;;;;;;;/q;;;;;+1;;;;;;;;;;;;;;;;;;;;;;;;;;;;;;;;;;;;;;;;;;;;;;;;;;;;;;;;;;;;;;;;;;;;;;;;;;;;;;;;;;;;;;;;/p-1
charge -13 multiplicity 13
98 atoms
Co -0.041808 -0.068584 -1.555173
Co -0.026415 -0.038503 1.565003
Mn 0.786769 2.481706 -0.035775
Co -0.836765 -2.655688 0.033902
H  0.559665 -4.84177 -0.709627
H  0.561882 -4.817648 0.845269
O  1.366854 0.406772 3.077505
O  -1.387539 -0.578652 -3.022979
O  -0.583695 2.027813 -1.372653
O  0.710213 -2.088236 1.46192
O  5.57859 -2.14585 0.02838
O  -5.45088 2.31113 -0.039168
O  2.431711 -2.004027 3.598523
O  -2.263637 1.87113 -3.551098
O  3.052437 0.196828 5.271527
O  -3.053691 -0.294653 -5.218904
O  3.31507 -0.91971 1.468073
O  -3.286964 0.881357 -1.453404
O  1.239244 0.589124 -0.005671
O  -1.261675 -0.659653 0.014207
O  3.313451 -0.963582 -1.440263
O  -3.293839 0.934276 1.424751
O  4.032696 1.431886 -0.019038
O  -4.055183 -1.50274 0.02569
O  2.654353 -3.246273 0.038893
O  -2.485904 3.29067 -0.053213
O  2.442051 -2.101747 -3.549544
O  -2.270698 1.988926 3.489116
O  3.823296 1.465071 -2.929324
O  -3.913872 -1.46763 2.883412
O  3.928412 4.04044 -0.051971
O  -4.312133 -4.04478 0.068453
O  6.15705 0.012914 1.320521
O  -6.143911 0.145392 -1.299732
O  6.986597 -2.460658 2.458258
O  -6.847456 2.605618 -2.47998
O  4.901935 -0.925057 3.493643
O  -4.818641 0.978291 -3.501291
O  4.321892 -3.225902 2.160751
O  -4.137808 3.224822 -2.173943
O  1.784655 -4.560777 -2.242822
O  -1.675787 4.469655 2.400121
O  0.697991 -2.151533 -1.436131
O  -0.58914 2.068186 1.314441
O  4.331933 -3.282962 -2.082066
O  -4.14475 3.298347 2.069845
O  6.9928 -2.518159 -2.39183
O  -6.853044 2.684475 2.38908
O  6.162943 -0.020747 -1.311885
O  -6.144084 0.188329 1.28722
O  5.771512 2.656523 -1.393078
O  -6.009461 -2.483111 1.408537
O  7.996732 1.6722 -0.015009
O  -8.150051 -1.36412 0.020813
O  5.767235 2.692451 1.330163
O  -6.00715 -2.529348 -1.325861
O  3.963947 4.335704 2.735164
O  -4.394468 -4.352784 -2.727695
O  2.04312 2.829727 1.303788
O  -2.233906 -3.195672 -1.417524
O  -1.671897 4.385431 -2.546756
O  1.764681 -4.486652 2.354901
O  3.043196 0.06764 -5.266675
O  -3.053352 -0.120852 5.225404
O  4.905487 -1.007967 -3.463591
O  -4.828442 1.090118 3.46687
O  1.372474 0.319412 -3.063074
O  -1.393563 -0.479746 3.035261
O  2.046293 2.794441 -1.382136
O  -2.229132 -3.137836 1.521246
O  0.329924 4.282534 -0.066426
O  -0.033334 -4.775763 0.067417
O  3.973339 4.261502 -2.846371
O  -4.389497 -4.25208 2.87129
O  3.818298 1.540151 2.892355
O  -3.910868 -1.568529 -2.836674
Al 2.940974 0.024428 0.000062
Al -2.941463 -0.094194 0.00542
W  3.011276 -0.090291 3.545262
W  -3.013613 -0.00237 -3.489673
W  3.882379 2.947399 -1.698399
W  -4.008785 -3.006909 1.698416
W  2.290882 -2.924932 -1.827085
W  -2.218786 2.919431 1.820606
W  5.477475 -1.827105 -1.875774
W  -5.4109 1.860493 1.844213
W  3.012529 -0.185875 -3.535474
W  -3.013819 0.12148 3.488846
W  2.292843 -2.868991 1.896482
W  -2.217905 2.85554 -1.91972
W  6.284425 1.328997 -0.015242
W  -6.404027 -1.2937 0.022815
W  5.475382 -1.77442 1.924053
W  -5.409996 1.795345 -1.903438
W  3.879009 2.993797 1.619434
W  -4.01454 -3.070157 -1.595775
O  1.414989 5.237047 -0.049643
H  2.243233 4.698182 -0.060672
