program: Gaussian 09
title: PCo4-Evac-b3lyp-hs-pcm. From the converged PCo4-Evac-bp86-hs-pcm-d
version: ES64L-G09RevE.01
frameworkgroup: C1[X(Co4H2O69P2W18)]
method: UB3LYP
basis: Gen
operation: FOpt
keyword: #p
keyword: opt
keyword: ub3lyp
keyword: gen
keyword: pseudo=read
keyword: scrf=(PCM,solvent=h2o)
keyword: guess=read
keyword: scf=(xqc)
title: #p opt ub3lyp gen pseudo=read scrf=(PCM,solvent=h2o) guess=read scf=(x
basis: NPDir=0 NMtPBC= 1 NCelOv= 1 NCel= 1 NClECP= 1 NCelD= 1
basis: NCelK= 1 NCelE2= 1 NClLst= 1 CellRange= 0.0.
basis: One-electron integrals computed using PRISM.
basis: 1 Symmetry operations used in ECPInt.
basis: ECPInt: NShTT= 109746 NPrTT= 673792 LenC2= 79528 LenP2D= 261313.
basis: LDataN: DoStor=T MaxTD1= 6 Len= 172
basis: NBasis= 1496 RedAO= T EigKep= 1.42D-04 NBF= 1496
basis: NBsUse= 1496 1.00D-06 EigRej= -1.00D+00 NBFU= 1496
converged: YES YES YES YES
dipole: 3.1819 2.3068 -0.0025
dipole: 3.9301
quadrupole: -2022.1275 -1370.2039 -1415.5154
quadrupole: 23.8193 -0.0256 -0.0252
quadrupole: -419.5119 232.4117 187.1002 23.8193 -0.0256 -0.0252
hfenergy: -7681.5239117 hartree
pointgroup: C01 [X(Co4H2O69P2W18)]
dipole: 1.250989 0.9087315 -0.0038327 debye
InChI: InChI=1S/4Co.2O4P.H2O.60O.18W/c;;;;2*1-5(2,3)4;;;;;;;;;;;;;;;;;;;;;;;;;;;;;;;;;;;;;;;;;;;;;;;;;;;;;;;;;;;;;;;;;;;;;;;;;;;;;;;/h;;;;;;1H2;;;;;;;;;;;;;;;;;;;;;;;;;;;;;;;;;;;;;;;;;;;;;;;;;;;;;;;;;;;;;;;;;;;;;;;;;;;;;;/q;;;+1;;-1;;;;;;;;;;;;;;;;;;;;;;;;;;;;;;;;;;;;;;;;;;;;;;;;;;;;;;;;;;;;;;;;;;;;;;;;;;;;;;;
charge -10 multiplicity 13
95 atoms
Co -0.00581737 0.04166994 1.69926535
Co -0.00662499 0.02931063 -1.69958155
Co 0.81509517 -2.53515109 0.00874618
Co -0.85133641 2.66866844 -0.00978179
H  0.43663732 4.8727607 0.76213888
H  0.43644016 4.86698241 -0.79763049
O  1.38883624 -0.50276256 -3.07868845
O  -1.39793181 0.5229586 3.08979025
O  -0.58077974 -1.97328997 1.42517784
O  0.61535375 2.00361573 -1.41791593
O  5.60080101 2.31216324 -0.00944114
O  -5.55284647 -2.40482709 0.00935869
O  2.36108793 1.89656969 -3.49032196
O  -2.3232145 -1.90395032 3.48706352
O  3.03234287 -0.23752385 -5.30489695
O  -3.04595996 0.2006292 5.3029177
O  3.2450222 0.77979523 -1.27538216
O  -3.21094439 -0.8066577 1.27117509
O  1.41073578 -0.48523412 0.00193914
O  -1.41023829 0.53367594 -0.00196234
O  3.2452279 0.78975761 1.26892853
O  -3.21113054 -0.81575541 -1.2651124
O  3.8450951 -1.3276511 0.00495848
O  -3.87593256 1.28303151 -0.00443693
O  2.4695552 3.26621767 -0.01253616
O  -2.33342519 -3.36046642 0.0123518
O  2.36218576 1.92300446 3.4755665
O  -2.32427004 -1.92910759 -3.47284384
O  3.84649429 -1.58454035 2.96657301
O  -3.89974442 1.51778955 -2.96154206
O  4.18602511 -3.96394059 0.01462556
O  -4.26750562 3.89311877 -0.0136721
O  6.2187266 0.15175407 -1.28589576
O  -6.22650905 -0.26174576 1.28631089
O  6.8833572 2.62041866 -2.52756773
O  -6.82089111 -2.74820765 2.52752799
O  4.79601208 0.92945865 -3.39053041
O  -4.77630996 -1.01271867 3.38624861
O  4.14961504 3.15003913 -2.06961622
O  -4.07235362 -3.20725554 2.04989606
O  1.58672065 4.45110168 2.35426901
O  -1.51903384 -4.43406374 -2.46859534
O  0.61579216 2.01417255 1.40294183
O  -0.58122994 -1.98377921 -1.41094909
O  4.15021254 3.16569003 2.0447589
O  -4.07299723 -3.22193953 -2.02563851
O  6.88408488 2.63971255 2.50589808
O  -6.8217015 -2.7664522 -2.50594554
O  6.21935264 0.16161683 1.28318712
O  -6.22717145 -0.27115747 -1.28283256
O  5.81995494 -2.46298827 1.35263233
O  -5.88916471 2.36266422 -1.3506285
O  8.11137137 -1.54563514 0.00498797
O  -8.1582869 1.39418828 -0.00399688
O  5.8197152 -2.47327945 -1.33512543
O  -5.88889358 2.37261601 1.33480087
O  4.23234567 -4.40888289 -2.77783806
O  -4.34318741 4.33342221 2.7816028
O  2.13811047 -3.12890542 -1.44839918
O  -2.21136941 3.09612305 1.47864944
O  -1.51809907 -4.41604075 2.50060912
O  1.58613531 4.43321157 -2.38798665
O  3.03409998 -0.1971883 5.30609708
O  -3.04772939 0.1622577 -5.3036624
O  4.79707533 0.9551745 3.38218942
O  -4.77736645 -1.03717795 -3.37770863
O  1.38983598 -0.47955776 3.08254905
O  -1.39873077 0.50070882 -3.09371753
O  2.13841378 -3.1167738 1.47143116
O  -2.21178125 3.08539923 -1.50090893
O  -0.14368055 4.76453819 -0.01729823
O  4.23218793 -4.38772527 2.81027845
O  -4.34405411 4.31326551 -2.81198534
O  3.84538656 -1.60696495 -2.95491357
O  -3.89892502 1.53914934 2.951292
P  2.91711516 -0.06747777 0.00012957
P  -2.90285031 0.05399317 -0.00009146
W  3.02583584 0.0064767 -3.58850979
W  -3.02013951 -0.04623356 3.5863401
W  3.91926675 -3.07751708 1.72027073
W  -3.99111391 3.01099053 -1.72211054
W  2.17946106 2.88935188 1.85591871
W  -2.11618671 -2.92611541 -1.86113404
W  5.49413179 1.84059081 1.85942592
W  -5.456823 -1.92559043 -1.85738424
W  3.02700702 0.03360952 3.58789234
W  -3.02120109 -0.07204407 -3.58534213
W  2.17895818 2.87528782 -1.87794872
W  -2.1155093 -2.91254442 1.88243973
W  6.40098351 -1.29150222 0.00425659
W  -6.44141965 1.18360238 -0.00348125
W  5.49356233 1.82628945 -1.87463823
W  -5.45614235 -1.91215764 1.87250763
W  3.91911834 -3.09062701 -1.69769192
W  -3.99061264 3.02324014 1.70112607
