program: Gaussian 09
title: AlCo4-Eoh-b3lyp-ls-pcmbb. From the converged PCo4 structure
version: ES64L-G09RevE.01
frameworkgroup: C1[X(Al2Co4H3O70W18)]
method: UB3LYP
basis: Gen
operation: FOpt
keyword: #p
keyword: opt
keyword: ub3lyp
keyword: gen
keyword: pseudo=read
keyword: scrf=(PCM,solvent=h2o)
keyword: guess=read
keyword: scf=xqc
title: #p opt ub3lyp gen pseudo=read scrf=(PCM,solvent=h2o) guess=read scf=xq
basis: NPDir=0 NMtPBC= 1 NCelOv= 1 NCel= 1 NClECP= 1 NCelD= 1
basis: NCelK= 1 NCelE2= 1 NClLst= 1 CellRange= 0.0.
basis: One-electron integrals computed using PRISM.
basis: 1 Symmetry operations used in ECPInt.
basis: ECPInt: NShTT= 113050 NPrTT= 692493 LenC2= 81847 LenP2D= 268740.
basis: LDataN: DoStor=T MaxTD1= 6 Len= 172
basis: NBasis= 1515 RedAO= T EigKep= 1.29D-04 NBF= 1515
basis: NBsUse= 1515 1.00D-06 EigRej= -1.00D+00 NBFU= 1515
converged: YES YES YES YES
dipole: -2.8519 7.8688 -1.1366
dipole: 8.4465
quadrupole: -2442.6579 -1583.5945 -1581.6933
quadrupole: -24.5053 -1.4500 5.3783
quadrupole: -573.3427 285.7207 287.6219 -24.5053 -1.4500 5.3783
hfenergy: -7560.087065 hartree
pointgroup: C01 [X(Al2Co4H3O70W18)]
dipole: -1.1216982 3.0956713 -0.4491855 debye
InChI: InChI=1S/2Al.4Co.2H2O.68O.18W/h;;;;;;2*1H2;;;;;;;;;;;;;;;;;;;;;;;;;;;;;;;;;;;;;;;;;;;;;;;;;;;;;;;;;;;;;;;;;;;;;;;;;;;;;;;;;;;;;;/q;;;;;+1;;;;;;;;;;;;;;;;;;;;;;;;;;;;;;;;;;;;;;;;;;;;;;;;;;;;;;;;;;;;;;;;;;;;;;;;;;;;;;;;;;;;;;;;/p-1
charge -14 multiplicity 10
97 atoms
Co 0.00833906 -0.01475189 -1.53098965
Co 0.01214196 -0.00536853 1.56066676
Co 0.81000725 2.60135605 -0.00181898
Co -0.78253822 -2.55685772 0.00342555
H  0.2176579 -4.48725746 -0.78468835
H  -0.5837149 4.78263821 0.77131497
H  -0.58557578 4.78069213 -0.7847405
O  1.40088614 0.50837964 3.03873601
O  -1.39528201 -0.41002233 -3.0433852
O  -0.70744459 2.07014985 -1.43762983
O  0.61266073 -2.0965214 1.39905869
O  5.51037363 -2.29355851 0.00455074
O  -5.5758874 2.20011475 0.000019
O  2.34030152 -1.923656 3.55716532
O  -2.4188099 2.01762831 -3.56747368
O  3.08499016 0.23878642 5.22909787
O  -3.05368721 -0.1639886 -5.25900967
O  3.3104342 -0.91058121 1.45262868
O  -3.32312803 0.91255246 -1.44663792
O  1.2574508 0.60558398 0.01071502
O  -1.24886886 -0.64776742 0.02085663
O  3.30122912 -0.93053602 -1.43453765
O  -3.32368595 0.91217016 1.45536435
O  4.04178841 1.49771791 -0.01682208
O  -4.04217362 -1.47038325 -0.00140618
O  2.56920795 -3.26434604 0.0363206
O  -2.63533026 3.21604884 0.00774221
O  2.29384755 -1.99177908 -3.51224874
O  -2.43517302 2.01470497 3.57972322
O  3.88629519 1.49579332 -2.89083808
O  -3.85901849 -1.52515331 2.89875529
O  4.27028396 4.05141036 -0.04128914
O  -4.10446711 -4.05580594 -0.01163334
O  6.14826793 -0.1272519 1.27140598
O  -6.15852601 0.04723496 -1.30669221
O  6.92407815 -2.58017483 2.44439375
O  -6.98026627 2.51344578 -2.43294197
O  4.87912901 -0.97638197 3.48503945
O  -4.89957515 0.97741081 -3.48643742
O  4.22788464 -3.23506306 2.15273459
O  -4.29910439 3.23822848 -2.11874558
O  1.67745536 -4.47343939 -2.33743895
O  -1.76211423 4.49157455 2.31186106
O  0.61536066 -2.08976688 -1.33014796
O  -0.70386766 2.08036506 1.46339415
O  4.1839854 -3.27933515 -2.10728087
O  -4.30999066 3.23461522 2.1277647
O  6.88634242 -2.63688727 -2.43957443
O  -6.98988417 2.50405783 2.42917786
O  6.14347599 -0.15272817 -1.3179215
O  -6.15929411 0.04276166 1.296072
O  5.96706589 2.51364158 -1.4035704
O  -5.85058855 -2.62956623 1.35732063
O  8.13456806 1.40755004 -0.03884638
O  -8.05538968 -1.59751499 -0.00778187
O  5.98540295 2.54486939 1.32587244
O  -5.84825601 -2.62290986 -1.37334266
O  4.36092319 4.33165085 2.76000234
O  -4.06498748 -4.31507813 -2.80167333
O  2.21417152 3.15524141 1.44197992
O  -2.10191509 -2.89612068 -1.37778173
O  -1.74775142 4.48864465 -2.29383498
O  1.79011804 -4.43268805 2.51433503
O  3.03484641 0.14515823 -5.2336574
O  -3.08156395 -0.17432404 5.26099055
O  4.83239004 -1.04965021 -3.48431403
O  -4.91165999 0.96377839 3.48333988
O  1.38321213 0.45983483 -3.02618104
O  -1.38833969 -0.40065242 3.07357852
O  2.19922955 3.11725711 -1.48705754
O  -2.10394143 -2.94011727 1.3632026
O  0.01224812 4.75155049 -0.00676314
O  -0.36359243 -4.38155719 -0.01734413
O  4.32810771 4.28752028 -2.8429708
O  -4.08725496 -4.32586584 2.78396462
O  3.90550586 1.5438206 2.84746126
O  -3.87090559 -1.51540587 -2.91399133
Al 2.94299116 0.0767459 0.00382007
Al -2.93446432 -0.07047169 0.00470254
W  3.03537241 -0.04855014 3.49582773
W  -3.03656036 0.09726287 -3.52269289
W  3.98051237 3.02416099 -1.6753945
W  -3.89359569 -3.0164762 1.63181058
W  2.23010419 -2.88682289 -1.83110274
W  -2.2941178 2.86327196 1.87418566
W  5.4306046 -1.84721753 -1.87132679
W  -5.48892506 1.78567116 1.88980746
W  3.01406504 -0.10092639 -3.49390942
W  -3.04226665 0.09242418 3.52605376
W  2.23061955 -2.86353342 1.88576081
W  -2.29139813 2.86217327 -1.8607269
W  6.38704729 1.30002067 -0.02616562
W  -6.32027361 -1.36088759 -0.00561483
W  5.44651212 -1.8184469 1.8927165
W  -5.48425831 1.78853176 -1.88879611
W  3.9962642 3.04921328 1.61843216
W  -3.88992726 -3.00598974 -1.6454681
