program: Gaussian 09
title: Fe_N-SiCo3-EoohIV-b3lyp-hs-pcm_fromHSfromLSPb. From the converged LS structure
version: ES64L-G09RevE.01
frameworkgroup: C1[X(Al2Co3FeH3O71W18)]
method: UB3LYP
basis: Gen
operation: Freq
keyword: #P
keyword: Geom=AllCheck
keyword: Guess=TCheck
keyword: SCRF=Check
keyword: GenChk
keyword: UB3LYP/ChkBasFreq
title: Fe_N-SiCo3-EoohIV-b3lyp-hs-pcm_fromHSfromLSPb. From the converged LS s
converged: YES YES NO YES
polarizability: 2.12846765e+03 4.79511023e+01 1.88329930e+03 2.23418977e-02 9.21124764e-03 1.86332490e+03
1716.lowfreq: -10.5494 -6.2610 -5.7113 -0.0095 -0.0071 -0.0070 19.9595 29.5537 31.7655
redmass: 64.5811 47.1228 53.1257 57.1056 37.4044 59.0031 44.5578 52.5450 30.7783 62.9897 55.4971 56.8940 38.7098 46.7112 51.3444 43.3297 40.6490 31.1725 42.4994 25.8624 25.2912 38.2982 41.6414 32.4434 23.2889 26.2531 33.0066 30.9880 19.5253 37.7340 22.5310 47.4777 32.0325 25.5393 23.8564 23.9052 30.9984 26.4830 30.3012 32.5584 28.0925 22.0308 29.8116 24.8015 16.3676 24.8172 20.6201 26.0223 21.6639 17.6695 22.6591 26.5545 26.9286 24.4482 14.9680 12.5387 26.3383 22.0073 20.8280 32.3432 23.0295 27.4670 26.0015 20.8205 25.3545 23.8124 20.2003 29.0183 20.5493 24.4812 17.1189 25.1578 24.1555 19.8201 26.2007 29.1214 26.0157 21.1235 20.1069 26.9299 26.3181 20.3568 24.2418 18.4705 18.3844 17.9214 18.9674 17.0001 23.8152 21.9515 18.0821 18.0849 17.9693 18.4521 21.7848 17.3585 16.8420 23.7383 15.6966 17.0664 16.9212 17.1013 16.2575 19.0488 16.9008 19.9337 16.5322 21.1240 18.8856 18.9079 16.6501 16.1994 15.5371 16.7251 18.2601 11.9939 22.5863 17.3350 15.5323 17.0570 17.4487 17.0247 15.1132 17.8090 19.3477 17.2846 18.7182 17.3235 16.8219 16.2493 16.8942 17.6011 16.9183 16.8509 16.9680 16.4290 16.9645 17.3790 17.1869 16.6495 17.6173 17.4392 18.2879 16.8790 17.0693 17.3396 18.6888 15.5067 17.4262 18.1585 18.7880 17.6615 18.2510 15.8751 18.1465 18.3100 16.9920 17.4501 17.9639 17.2309 17.1742 17.3299 18.4780 18.0320 17.3711 17.8802 16.3854 16.1491 16.9003 17.0454 14.1242 16.8278 17.7077 16.1870 16.4640 1.5655 15.0493 8.6650 17.0604 7.1978 17.2319 17.3386 16.3845 17.8362 16.6857 16.6660 16.7526 16.8727 17.2692 16.7070 17.7304 17.2474 16.8773 16.5911 16.8359 17.0030 16.2737 13.5795 16.2421 16.8149 9.1683 16.8701 2.5253 16.2458 17.0053 3.7210 4.6162 17.0015 16.9462 16.9441 16.9343 7.5989 12.4040 17.0863 15.7407 16.6148 13.6426 11.6569 16.6361 15.2392 16.6510 15.9096 16.6839 15.6822 16.8694 16.3165 15.7272 16.5707 16.3633 15.6019 16.0262 12.6696 15.5742 6.8142 16.9053 13.1330 15.9486 4.1567 2.5389 14.2786 17.1722 16.6003 1.1933 16.5933 10.2470 11.7268 12.7023 4.9577 9.4148 14.6920 10.5874 13.1683 14.3946 16.3815 17.0564 17.0529 16.9297 16.3179 17.0668 16.9666 17.3439 17.2833 17.3639 16.8095 16.3403 15.9764 16.3913 16.6977 16.8336 16.6199 16.8010 16.7742 16.5141 16.4471 16.4770 16.4408 16.3944 17.1664 17.1577 16.8840 16.7398 16.7912 16.8002 1.0876 1.0728 1.0466 1.0687 1.0858
irintensity: 0.0087 0.2999 0.1461 0.7321 0.8489 0.3565 0.1551 0.0516 0.0475 4.4239 4.1874 0.9643 0.6219 0.5922 0.0042 1.0887 12.9135 0.8854 2.8416 32.3404 29.2123 0.0107 9.2981 1.5255 55.4247 7.6977 0.4213 6.0212 20.8936 2.5431 1.6835 12.1589 0.0029 0.2449 16.8812 2.4262 0.0481 4.5033 1.4502 24.6321 0.5411 6.5991 1.3816 22.8659 0.0553 39.8241 0.9531 1.9448 11.6610 1.0727 22.7212 8.2243 25.0604 0.7943 5.7928 0.2217 64.2944 0.0566 5.7371 10.2551 29.8684 2.5916 38.5141 0.4182 31.2395 0.5393 83.2592 41.5799 9.3736 8.7627 13.2695 9.0933 32.4354 1.2431 50.9227 12.4703 10.0922 93.0085 1.2150 0.9323 252.6827 54.2647 24.4835 20.7841 1.1922 12.8814 2.9912 55.5440 24.7068 18.1210 26.1614 3.1210 80.0447 1.6010 12.0477 42.9563 88.2800 389.8528 204.7213 182.3740 128.4882 30.8606 15.9210 16.6477 1.0757 25.5992 92.3846 172.3820 18.0418 66.5404 0.7334 16.4745 1.9464 0.3844 29.4759 638.1851 263.6243 231.9266 3.9057 75.2554 157.8655 5.1033 163.2093 513.5039 174.3312 56.6575 115.0184 3.1425 212.0007 42.5803 89.5163 505.3290 73.8608 3.9354 179.0969 241.4371 230.1601 4.4717 151.6888 8.3577 222.5137 183.4147 281.0106 0.1657 43.7782 1379.2603 608.5236 366.1226 2.2029 67.2605 122.0784 449.9785 227.5029 49.6299 196.6012 358.2506 1.8372 27.3159 163.3881 359.2653 16.2455 210.3342 67.4722 327.0966 319.7578 221.9086 253.2733 156.2053 185.9539 141.0655 96.1293 15.6403 19.7270 444.0094 76.0831 75.3792 100.1574 7.5547 32.8742 31.3325 78.5852 49.9403 4.5595 13.3088 49.4337 50.3730 17.4082 83.6344 194.6827 3.4127 418.9410 16.1973 255.6575 653.4159 266.1661 380.0559 161.0003 39.5811 12.1086 154.4112 6.5147 39.5260 94.0949 76.4067 575.9590 139.5557 8.4332 1115.9739 110.0107 180.7676 18.5496 8.4150 22.2709 265.4624 1.5617 799.2721 238.9032 1.3583 747.1741 4.1968 21.5983 106.8514 402.7156 3.1161 181.3045 2.2868 69.2956 368.3285 2.9913 19.7506 6907.5332 2572.4649 5967.0556 7596.3657 178.2757 2146.8504 5634.7863 265.0587 46.6768 1407.0001 680.4616 422.6173 4.3054 1467.4829 1251.3538 493.2443 2633.2235 78.4350 323.2746 336.8231 99.1570 4.6529 1426.8751 2908.4689 518.0936 819.0931 451.5687 396.5218 617.8027 299.7711 383.5669 1.9262 1839.7989 137.1229 911.0467 16.3140 363.7554 147.8464 939.6278 303.5767 905.8363 459.7850 3.9844 58.9002 1.0708 11.4008 48.3258 155.4347 7.1695 4.0823 2.6374 5.1853 6.3073 53.0772 91.8973 572.7471 333.8796 351.0882
temp: 298.150 k
press: 1.00000 atm
elementType: 27 27 26 27 1 1 8 8 8 8 8 8 8 8 8 8 8 8 8 8 8 8 8 8 8 8 8 8 8 8 8 8 8 8 8 8 8 8 8 8 8 8 8 8 8 8 8 8 8 8 8 8 8 8 8 8 8 8 8 8 8 8 8 8 8 8 8 8 8 8 8 8 8 8 8 8 13 13 74 74 74 74 74 74 74 74 74 74 74 74 74 74 74 74 74 74 8 1
symmnumber: 1
zpe: 758978.8 jmol-1
zpe.correction: 0.289080 hartree
zpe.thermalcorrener: 0.401121 hartree
zpe.thermalcorrenthalpy: 0.402065 hartree
zpe.thermalcorrgfe: 0.150220 hartree
zpe.sumelectzpe: -7613.173688 hartree
zpe.sumelectthermal: -7613.061646 hartree
zpe.sumelectthermalent: -7613.060702 hartree
zpe.sumelectthermalfe: -7613.312548 hartree
dipole: 4.4584 -8.1834 0.0035
dipole: 9.3191
quadrupole: -2315.9030 -1563.5549 -1543.5398
quadrupole: -17.6429 0.0103 0.0030
quadrupole: -508.2371 244.1110 264.1261 -17.6429 0.0103 0.0030
hfenergy: -7613.4627676 hartree
pointgroup: C01 [X(Al2Co3Fe1H3O71W18)]
dipole: 1.754184 -3.2195256 0.0013838 debye
polarizability: 2128.464413|47.9593679|1883.3025334|0.0223416|0.009212|1863.3249021 unknown
InChI: InChI=1S/2Al.3Co.Fe.H2O2.H2O.68O.18W/c;;;;;;1-2;;;;;;;;;;;;;;;;;;;;;;;;;;;;;;;;;;;;;;;;;;;;;;;;;;;;;;;;;;;;;;;;;;;;;;;;;;;;;;;;;;;;;;;/h;;;;;;1-2H;1H2;;;;;;;;;;;;;;;;;;;;;;;;;;;;;;;;;;;;;;;;;;;;;;;;;;;;;;;;;;;;;;;;;;;;;;;;;;;;;;;;;;;;;;/q;;;;;+1;;;;;;;;;;;;;;;;;;;;;;;;;;;;;;;;;;;;;;;;;;;;;;;;;;;;;;;;;;;;;;;;;;;;;;;;;;;;;;;;;;;;;;;;/p-1
charge -13 multiplicity 14
98 atoms
Co -0.02915193 0.10713996 -1.5591353
Co -0.0291343 0.10702912 1.55913238
Fe 0.74845865 2.67673526 0.00015512
Co -0.73980414 -2.46736103 -0.00005604
H  0.50914264 -4.86317677 -0.77839731
H  0.50906516 -4.86324582 0.77805837
O  1.38259941 0.4941715 3.01983245
O  -1.36359447 -0.36315022 -3.07044253
O  -0.71846462 2.18959837 -1.41691633
O  0.59204913 -2.03247149 1.35114101
O  5.43068267 -2.32111034 -0.00006033
O  -5.61027949 2.11737124 0.00004329
O  2.25558875 -1.97752623 3.53221333
O  -2.44946604 2.01943834 -3.55886641
O  3.0178381 0.16870772 5.2343446
O  -3.05815268 -0.16625164 -5.25826452
O  3.26077939 -0.92585514 1.44150129
O  -3.34798061 0.92961789 -1.45410314
O  1.25248027 0.72180981 0.00002904
O  -1.24433919 -0.48067886 0.00000263
O  3.2607211 -0.92583852 -1.44167129
O  -3.34792689 0.92961869 1.45409295
O  4.06068738 1.45124688 -0.0002914
O  -3.97252048 -1.49159011 -0.00001851
O  2.49258468 -3.25788051 -0.00016973
O  -2.68918214 3.29099544 -0.00000177
O  2.25558065 -1.97726126 -3.53251214
O  -2.44956447 2.01937047 3.55890076
O  3.91196371 1.48665974 -2.89195813
O  -3.77733944 -1.54931908 2.88475436
O  4.22040284 4.02308763 0.00020044
O  -3.95526026 -4.08680321 -0.00004837
O  6.12059725 -0.18282534 1.29958313
O  -6.14129494 -0.04834757 -1.30475229
O  6.82905183 -2.67081106 2.43145216
O  -7.03019553 2.40015968 -2.4274651
O  4.8040958 -1.0625581 3.48487006
O  -4.9139256 0.91971152 -3.48485579
O  4.1194684 -3.28874485 2.1249317
O  -4.37573412 3.210536 -2.12010248
O  1.5769876 -4.46185234 -2.33114627
O  -1.93955145 4.51224459 2.44486007
O  0.59204026 -2.03237081 -1.35125581
O  -0.71853604 2.18945797 1.41713689
O  4.11939412 -3.28863009 -2.1251532
O  -4.37588382 3.21033682 2.12026757
O  6.82897673 -2.67073771 -2.43157844
O  -7.03033636 2.39987607 2.42756849
O  6.12057887 -0.18274488 -1.29955691
O  -6.14129172 -0.04843287 1.30461564
O  5.95888798 2.5028169 -1.36062252
O  -5.73862819 -2.71040948 1.36538594
O  8.10466444 1.35842823 0.00000179
O  -7.97403891 -1.75081658 -0.00010865
O  5.95890032 2.50267526 1.36082092
O  -5.73867525 -2.71041477 -1.36556865
O  4.31034671 4.2748451 2.80144196
O  -3.93798563 -4.35110742 -2.7893331
O  2.21137834 3.03509421 1.43931323
O  -1.9822118 -2.93942797 -1.34926554
O  -1.93928442 4.51229655 -2.44496515
O  1.57709208 -4.46210801 2.33063932
O  3.01803242 0.1693262 -5.23424709
O  -3.05803489 -0.16615778 5.25842655
O  4.80407164 -1.06230345 -3.48484353
O  -4.9140413 0.91944045 3.48493512
O  1.38265701 0.49427966 -3.0197537
O  -1.36346341 -0.36333786 3.0706268
O  2.21123024 3.03528597 -1.43915355
O  -1.98229739 -2.93951573 1.3490505
O  0.41575687 4.60196744 0.0004083
O  -0.08341745 -4.85698002 -0.00020003
O  4.31025479 4.27524647 -2.80095173
O  -3.93810129 -4.35081463 2.78937367
O  3.91193351 1.48629467 2.89221603
O  -3.77749734 -1.54950703 -2.88478962
Al 2.91198085 0.07785954 -0.00007991
Al -2.95229879 -0.02618146 -0.00001048
W  2.99807743 -0.08800855 3.50214079
W  -3.02307334 0.10469327 -3.52722872
W  4.00242235 2.98711634 -1.65731053
W  -3.80454429 -3.0395827 1.63987171
W  2.19324732 -2.88123377 -1.86868308
W  -2.36260002 2.92102164 1.86925895
W  5.38515294 -1.86262444 -1.87847483
W  -5.51160676 1.72451549 1.8916005
W  2.99832064 -0.08740966 -3.50204125
W  -3.02271692 0.10522542 3.52746624
W  2.19340331 -2.8815244 1.86809854
W  -2.36242241 2.92096195 -1.8697526
W  6.36281841 1.24957413 -0.00003283
W  -6.25596395 -1.4343007 -0.00016384
W  5.38523384 -1.86261953 1.87845011
W  -5.5115025 1.72476173 -1.89143044
W  4.00253851 2.9866219 1.65788258
W  -3.80451012 -3.04014253 -1.63952646
O  1.56908852 5.46361404 0.0005288
H  2.32715824 4.84177708 0.00061525
