program: Gaussian 09
title: Ni_N-PCo3-Eo-b3lyp-ls-pcmbb. From the converged PCo4 structure
version: ES64L-G09RevE.01
frameworkgroup: CS[SG(CoNiO14P2W2),X(Co2H2O56W16)]
method: UB3LYP
basis: Gen
operation: FOpt
keyword: #p
keyword: opt
keyword: ub3lyp
keyword: gen
keyword: pseudo=read
keyword: scrf=(PCM,solvent=h2o)
keyword: guess=read
keyword: scf=xqc
title: #p opt ub3lyp gen pseudo=read scrf=(PCM,solvent=h2o) guess=read scf=xq
basis: NPDir=0 NMtPBC= 1 NCelOv= 1 NCel= 1 NClECP= 1 NCelD= 1
basis: NCelK= 1 NCelE2= 1 NClLst= 1 CellRange= 0.0.
basis: One-electron integrals computed using PRISM.
basis: One-electron integral symmetry used in STVInt
basis: 2 Symmetry operations used in ECPInt.
basis: ECPInt: NShTT= 111628 NPrTT= 686625 LenC2= 80870 LenP2D= 265497.
basis: LDataN: DoStor=T MaxTD1= 6 Len= 172
basis: NBasis= 1510 RedAO= T EigKep= 1.05D-04 NBF= 821 689
basis: NBsUse= 1510 1.00D-06 EigRej= -1.00D+00 NBFU= 821 689
converged: YES YES YES YES
dipole: 5.7764 -3.5149 -0.0000
dipole: 6.7618
quadrupole: -1386.0283 -2001.7799 -1412.5475
quadrupole: -24.6179 0.0000 0.0000
quadrupole: 214.0903 -401.6614 187.5711 -24.6179 0.0000 0.0000
hfenergy: -7780.8232324 hartree
pointgroup: CS [SG(Co1Ni1O14P2W2),X(Co2H2O56W16)]
dipole: 2.2726275 -1.3828691 0. debye
InChI: InChI=1S/3Co.Ni.2O4P.H2O.61O.18W/c;;;;2*1-5(2,3)4;;;;;;;;;;;;;;;;;;;;;;;;;;;;;;;;;;;;;;;;;;;;;;;;;;;;;;;;;;;;;;;;;;;;;;;;;;;;;;;;/h;;;;;;1H2;;;;;;;;;;;;;;;;;;;;;;;;;;;;;;;;;;;;;;;;;;;;;;;;;;;;;;;;;;;;;;;;;;;;;;;;;;;;;;;/q;;;+1;;-1;;;;;;;;;;;;;;;;;;;;;;;;;;;;;;;;;;;;;;;;;;;;;;;;;;;;;;;;;;;;;;;;;;;;;;;;;;;;;;;;
charge -10 multiplicity 10
96 atoms
Co 0.00662671 0.01473976 1.71180711
Co 0.00662671 0.01473976 -1.71180711
Co 2.66699087 0.8630549 0.0000
Ni -2.52339353 -0.83784062 0.0000
H  4.87498228 -0.41437146 -0.78047651
H  4.87498228 -0.41437146 0.78047651
O  0.5442106 1.40129184 -3.08482064
O  -0.48180063 -1.38377849 3.1029905
O  1.9920634 -0.60359328 1.40468873
O  -1.97626796 0.5570558 -1.3948395
O  -2.38901298 5.54496171 0.0000
O  2.32977226 -5.59193174 0.0000
O  -1.88569367 2.2983902 -3.46148983
O  1.9230514 -2.35102159 3.48399615
O  0.20060139 3.04139417 -5.29997746
O  -0.19520479 -3.0401391 5.31565931
O  -0.79521554 3.21547322 -1.26783908
O  0.77804774 -3.19650519 1.2697382
O  0.54155557 1.41531564 0.0000
O  -0.57558231 -1.40127343 0.0000
O  -0.79521554 3.21547322 1.26783908
O  0.77804774 -3.19650519 -1.2697382
O  1.3000207 3.88076231 0.0000
O  -1.30587276 -3.87496482 0.0000
O  -3.35527017 2.32998412 0.0000
O  3.27346401 -2.44158133 0.0000
O  -1.88569367 2.2983902 3.46148983
O  1.9230514 -2.35102159 -3.48399615
O  1.54933482 3.90810614 2.9594763
O  -1.56244981 -3.86576422 -2.97105451
O  3.91458616 4.2744687 0.0000
O  -3.93717362 -4.19145125 0.0000
O  -0.25092634 6.2217528 -1.28576472
O  0.18490716 -6.21938696 1.28805528
O  -2.74085172 6.812456 -2.51629332
O  2.67352446 -6.86640853 2.51939037
O  -1.0141757 4.76511642 -3.38447913
O  0.97230083 -4.78693715 3.38006965
O  -3.19799212 4.06395682 -2.03695775
O  3.17103323 -4.12651742 2.04431083
O  -4.40809872 1.55118785 2.51968356
O  4.43903283 -1.54730517 -2.36933083
O  -1.97626796 0.5570558 1.3948395
O  1.9920634 -0.60359328 -1.40468873
O  -3.19799212 4.06395682 2.03695775
O  3.17103323 -4.12651742 -2.04431083
O  -2.74085172 6.812456 2.51629332
O  2.67352446 -6.86640853 -2.51939037
O  -0.25092634 6.2217528 1.28576472
O  0.18490716 -6.21938696 -1.28805528
O  2.38509793 5.89366693 1.34287872
O  -2.44319223 -5.83258626 -1.34280644
O  1.40357826 8.15791961 0.0000
O  -1.49932757 -8.11989553 0.0000
O  2.38509793 5.89366693 -1.34287872
O  -2.44319223 -5.83258626 1.34280644
O  4.34567155 4.34769705 -2.79580171
O  -4.3651538 -4.21752087 2.79050959
O  3.10510174 2.2193815 -1.49066983
O  -3.02538324 -2.16058955 1.44508418
O  4.43903283 -1.54730517 2.36933083
O  -4.40809872 1.55118785 -2.51968356
O  0.20060139 3.04139417 5.29997746
O  -0.19520479 -3.0401391 -5.31565931
O  -1.0141757 4.76511642 3.38447913
O  0.97230083 -4.78693715 -3.38006965
O  0.5442106 1.40129184 3.08482064
O  -0.48180063 -1.38377849 -3.1029905
O  3.10510174 2.2193815 1.49066983
O  -3.02538324 -2.16058955 -1.44508418
O  4.76551412 0.16438625 0.0000
O  -4.23697032 -0.27705225 0.0000
O  4.34567155 4.34769705 2.79580171
O  -4.3651538 -4.21752087 -2.79050959
O  1.54933482 3.90810614 -2.9594763
O  -1.56244981 -3.86576422 2.97105451
P  0.07041086 2.90740928 0.0000
P  -0.08245051 -2.90482581 0.0000
W  -0.02972095 3.02159553 -3.58128959
W  0.03622808 -3.02191995 3.59854816
W  3.03956741 3.99781779 1.71083299
W  -3.04332269 -3.9431208 -1.70493234
W  -2.90919208 2.11433051 1.87267834
W  2.88436648 -2.15212333 -1.86510975
W  -1.90065347 5.44996297 1.86375566
W  1.86640234 -5.48410154 -1.86971193
W  -0.02972095 3.02159553 3.58128959
W  0.03622808 -3.02191995 -3.59854816
W  -2.90919208 2.11433051 -1.87267834
W  2.88436648 -2.15212333 1.86510975
W  1.19996211 6.44102413 0.0000
W  -1.24804422 -6.41069203 0.0000
W  -1.90065347 5.44996297 -1.86375566
W  1.86640234 -5.48410154 1.86971193
W  3.03956741 3.99781779 -1.71083299
W  -3.04332269 -3.9431208 1.70493234
